program: Gaussian 09
title: 000138389
version: EM64L-G09RevD.01
frameworkgroup: C1[X(C4H9N)]
method: RPBEPBE
basis: SDD
operation: Freq
keyword: #p
keyword: freq=noraman
keyword: PBEPBE/SDD
title: #p freq=noraman PBEPBE/SDD
converged: YES YES NO YES
title: Mulliken charges:
elementType: N C C C C H H H H H H H H H
charge: -0.067178 -0.462666 -0.376421 -0.376422 -0.634600 0.227406 0.228996 0.229486 0.182039 0.182039 0.229487 0.227395 0.183043 0.227395
chargesum: 0.00000
title: Mulliken charges with hydrogens summed into heavy atoms:
elementType: N C C C C
charge: -0.067178 -0.006264 0.035104 0.035104 0.003234
polarizability: 5.41642154e+01 -8.06768113e-06 4.97678679e+01 -2.60274270e-01 6.53727617e-07 4.16006076e+01
1716.lowfreq: -0.0008 -0.0007 -0.0004 5.1597 11.8058 17.6754 161.1137 221.4781 314.7968
frequency: 161.1121 221.4762 314.7915 324.2417 629.8231 741.4008 843.3780 898.4225 935.2937 961.2658 977.4925 1078.6501 1091.4589 1135.4516 1151.7443 1175.4878 1209.7102 1210.8227 1251.1929 1280.0854 1308.6729 1423.5843 1460.2453 1464.7471 1473.0864 1474.5193 1495.3653 2846.0100 2896.2339 2909.6246 3016.3656 3037.5964 3039.8377 3052.8063 3072.5453 3122.3852
redmass: 1.9196 1.0433 2.1585 2.2823 3.2601 1.4519 1.1838 2.4789 2.0747 2.7181 2.9146 1.3040 1.1142 1.7310 1.4512 1.3221 1.4705 5.1584 1.4059 1.3895 1.5022 1.1606 1.0739 1.0735 1.0510 1.0770 1.1165 1.0566 1.0673 1.0697 1.0723 1.0821 1.0931 1.0739 1.1009 1.1086
irintensity: 2.4801 1.1861 9.3046 0.4041 10.8963 2.1375 2.5369 6.4344 0.0017 21.0127 5.5030 1.1970 1.2809 5.4513 0.1066 2.3476 2.7700 26.0746 14.8130 1.5884 0.6884 0.7111 19.3029 6.7441 6.2232 0.1526 7.3707 118.9935 104.3824 125.8057 46.9487 26.1020 70.9216 52.3007 29.1953 41.6896
temp: 298.150 k
press: 1.00000 atm
elementType: 7 6 6 6 6 1 1 1 1 1 1 1 1 1
symmnumber: 1
zpe: 327100.5 jmol-1
zpe.correction: 0.124586 hartree
zpe.thermalcorrener: 0.130072 hartree
zpe.thermalcorrenthalpy: 0.131017 hartree
zpe.thermalcorrgfe: 0.096413 hartree
zpe.sumelectzpe: -212.103201 hartree
zpe.sumelectthermal: -212.097714 hartree
zpe.sumelectthermalent: -212.096770 hartree
zpe.sumelectthermalfe: -212.131373 hartree
dipole: 0.1890 0.0000 1.1836
dipole: 1.1986
quadrupole: -30.6048 -31.1830 -33.7851
quadrupole: 0.0000 -0.6802 0.0000
quadrupole: 1.2529 0.6747 -1.9275 0.0000 -0.6802 0.0000
hfenergy: -212.2277865 hartree
pointgroup: C01 [X(C4H9N1)]
dipole: 0.0911931 -0.0000198 0.4626455 debye
dipolederiv: -0.579204 0.0000078 -0.0170544 0.0000084 -0.4534813 0.0000038 -0.0193073 0.0000055 -0.5282703 0.0257952 -0.0000074 0.0364467 -0.0000064 -0.0981967 -0.000012 0.003066 -0.0000102 0.1737815 0.1103544 -0.208555 0.0132477 -0.162367 0.3825534 0.0170423 -0.0108192 -0.0307266 0.3706755 0.1103929 0.2085815 0.0132605 0.1623951 0.3825087 -0.0170424 -0.0108046 0.0307276 0.370675 0.3774313 -0.0000109 -0.0982196 -0.0000111 0.0979138 -0.0000072 -0.1012061 -0.0000075 0.426786 -0.0717028 0.0000115 -0.0945612 0.0000137 0.0838856 0.0000096 -0.1576503 0.000013 -0.0448753 -0.0096316 0.0000016 0.0881017 -0.0000003 0.0858862 0.0000019 0.1393326 -0.0000008 -0.0868631 0.0529926 0.0084841 0.0062639 0.0490477 -0.1643019 -0.0960917 0.0149442 -0.1407155 -0.0134344 0.0057772 -0.0058299 0.0645869 0.0205987 -0.0396273 0.0669299 -0.0076465 0.1839202 -0.2305108 0.0057759 0.0058206 0.0645804 -0.0206025 -0.0396074 -0.0669226 -0.0076671 -0.1839051 -0.2305276 0.0529867 -0.0085069 0.0062734 -0.0490711 -0.1643113 0.0960792 0.0149554 0.1407023 -0.0134169 -0.0161496 0.0882064 -0.023011 0.1648566 -0.0682862 0.0626744 -0.0147642 0.0711378 0.0582192 -0.0486408 0.0000073 -0.0368906 -0.0000007 0.0633127 0.0000162 0.1723511 0.0000051 -0.3104477 -0.0161772 -0.0882107 -0.0230244 -0.1648611 -0.0682483 -0.0626815 -0.0147841 -0.0711458 0.0582088 unknown
polarizability: 54.1288798|-0.0002106|49.7678679|-0.7144488|0.0003342|41.6359433 unknown
InChI: InChI=1S/C4H9N/c1-5-3-2-4-5/h2-4H2,1H3
charge 0 multiplicity 1
14 atoms
N  -0.529778 -0.000007 -0.330314
C  1.582293 -0.000133 0.068061
C  0.441923 -1.071769 0.097538
C  0.442036 1.071624 0.097616
C  -1.881975 0.000043 0.239794
H  2.284948 -0.0002 0.914738
H  2.140095 -0.000127 -0.881379
H  0.515196 -1.929058 -0.593893
H  0.252901 -1.445593 1.131943
H  0.253052 1.445392 1.132048
H  0.515399 1.928953 -0.593754
H  -2.432559 0.89309 -0.108275
H  -1.892877 0.000001 1.360521
H  -2.432655 -0.892917 -0.108344
