program: Gaussian 09
title: 000138386
version: EM64L-G09RevD.01
frameworkgroup: C1[X(C8H14)]
method: RPBEPBE
basis: SDD
operation: Freq
keyword: #p
keyword: freq=noraman
keyword: PBEPBE/SDD
title: #p freq=noraman PBEPBE/SDD
converged: YES YES NO NO
title: Mulliken charges:
elementType: C C C C C C C C H H H H H H H H H H H H H H
charge: 0.174749 -0.692581 -0.692176 -0.692575 -0.003932 -0.452798 -0.041795 -0.661146 0.219951 0.220382 0.206181 0.219847 0.220536 0.206165 0.219967 0.219892 0.205953 0.231158 0.231079 0.212908 0.224056 0.224178
chargesum: 0.00000
title: Mulliken charges with hydrogens summed into heavy atoms:
elementType: C C C C C C C C
charge: 0.174749 -0.046066 -0.045627 -0.046763 -0.003932 0.009439 -0.041795 -0.000005
polarizability: 1.16247534e+02 3.37442515e+00 7.33252803e+01 -4.02779368e-03 9.27860667e-03 7.07582564e+01
1716.lowfreq: -0.0005 0.0003 0.0006 3.4955 8.2014 14.2441 43.9399 80.1790 99.1305
frequency: 39.9659 80.1553 99.1070 169.4488 193.8639 203.7835 256.7508 259.9968 298.5177 325.2259 345.3410 351.4711 464.9377 521.2772 531.1340 611.1656 780.7887 807.6311 919.6140 920.1496 936.2188 946.4049 1022.0973 1024.3510 1059.0088 1082.9492 1089.5446 1204.0931 1204.6830 1255.2651 1271.2934 1320.8267 1368.0931 1369.6132 1390.0851 1397.0262 1452.1844 1463.9222 1464.1606 1465.2154 1473.2915 1474.5379 1475.3862 1484.9602 1494.0611 2266.2095 2972.4474 2975.2947 2975.4738 2980.2616 2988.1981 3016.1449 3073.0907 3073.2603 3080.9572 3082.8564 3086.4976 3089.6856 3089.7814 3096.2496
redmass: 2.2270 3.0449 2.3374 3.2219 1.0162 1.3731 1.0520 1.0448 2.0303 2.7121 2.4014 2.3988 3.4739 4.6736 4.8793 3.0353 1.1734 2.7350 1.7439 1.7490 2.1039 1.1971 1.3941 1.3855 2.4361 1.4578 1.9013 2.8822 2.8864 1.1456 2.8171 1.5742 1.1881 1.1888 1.1967 1.2011 1.0503 1.0599 1.0573 1.0499 1.0420 1.0517 1.0521 1.0554 1.0635 11.8151 1.0587 1.0344 1.0345 1.0353 1.0353 1.1006 1.1000 1.1000 1.0988 1.1015 1.1001 1.1001 1.1001 1.1013
irintensity: 0.0144 2.1835 2.8706 0.0801 0.0035 0.5465 0.0045 0.0139 5.4885 1.3707 0.2180 0.1487 5.6734 0.9123 0.4907 0.4451 5.8152 0.9977 1.6482 1.6435 8.9583 0.0007 0.0274 0.0102 9.9927 0.8608 0.8653 11.6079 11.5109 0.0866 38.8216 25.8567 17.3792 17.9894 9.3539 4.9196 0.0330 4.2452 3.0349 0.1331 7.3766 14.8431 15.7847 8.1155 14.4074 0.0599 39.1794 30.4609 30.2759 40.7758 37.5714 12.1649 7.3722 7.8656 109.0313 1.4204 41.7736 48.0329 49.0407 41.6777
temp: 298.150 k
press: 1.00000 atm
elementType: 6 6 6 6 6 6 6 6 1 1 1 1 1 1 1 1 1 1 1 1 1 1
symmnumber: 1
zpe: 509704.9 jmol-1
zpe.correction: 0.194136 hartree
zpe.thermalcorrener: 0.205027 hartree
zpe.thermalcorrenthalpy: 0.205971 hartree
zpe.thermalcorrgfe: 0.158004 hartree
zpe.sumelectzpe: -312.546853 hartree
zpe.sumelectthermal: -312.535962 hartree
zpe.sumelectthermalent: -312.535018 hartree
zpe.sumelectthermalfe: -312.582986 hartree
dipole: -0.1100 0.0472 0.0008
dipole: 0.1197
quadrupole: -44.8048 -51.3709 -51.2889
quadrupole: 1.2135 0.0005 -0.0019
quadrupole: 4.3501 -2.2161 -2.1340 1.2135 0.0005 -0.0019
hfenergy: -312.7409892 hartree
pointgroup: C01 [X(C8H14)]
dipole: 0.0430184 0.01916 -0.0002898 debye
dipolederiv: 0.3771051 -0.0146531 0.000575 -0.02306 0.1888258 -0.0019037 0.0023485 0.0017868 0.1847547 -0.0329669 -0.0042291 -0.0280619 0.0218493 0.0333123 -0.0255328 0.0239021 -0.0314492 -0.0300522 -0.0338606 -0.0153421 0.0262916 0.0257904 0.0160814 0.0387778 -0.0189801 0.0420642 -0.0095014 -0.0392157 0.0143233 0.0022659 -0.0333757 -0.0421419 -0.011604 -0.0068699 -0.0117617 0.0431085 -0.0672688 -0.0528774 -0.0005863 -0.0098456 -0.1990838 0.0005167 -0.0000754 -0.0000327 -0.1986445 0.2334589 -0.0281869 0.0005368 -0.0520879 0.1470709 0.0031698 -0.0003156 -0.0030623 0.2139321 -0.1051627 -0.0212687 0.0001552 -0.0832911 -0.2097612 -0.0013548 -0.0005418 0.0005589 -0.1802145 -0.0016268 -0.0311134 0.001164 0.0581668 0.0102155 -0.0006852 0.0001551 0.0008479 0.0772817 0.0674087 -0.0612982 0.0856598 -0.048169 0.0225805 0.1155741 0.057514 0.0748585 -0.0815318 0.1001478 0.0474249 -0.0011292 0.0203185 -0.1580309 -0.0684035 0.0008671 -0.0223815 0.067394 -0.2227601 0.0320577 -0.0359254 0.0427636 0.0876562 -0.0079499 -0.0187398 -0.0128757 0.0658812 0.0739603 -0.035523 -0.0904275 -0.0284625 0.0631111 -0.0784714 -0.0589754 -0.0379921 -0.1291759 0.0997752 0.0465302 0.0139551 0.018594 -0.1656086 0.0070166 0.0053639 -0.0375513 0.0761696 -0.225069 0.0216607 0.0305887 0.0374371 0.0804429 0.0133646 0.0159548 0.0183418 0.0743555 0.0682767 -0.0652237 0.0822308 -0.0490085 -0.0096444 0.0789242 0.0704532 0.1245769 -0.0504256 0.0751262 -0.0370917 -0.0896178 -0.0267597 0.0392723 -0.0548797 -0.0738804 -0.101756 -0.1060759 -0.2127594 0.0773887 0.0041491 0.0623123 0.0506223 -0.0059199 0.0016974 -0.0046603 0.0976256 -0.0495326 0.0275598 0.0333183 0.0267562 -0.0012717 -0.0983189 0.078821 -0.1274825 -0.0389692 -0.050059 0.0249812 -0.0354553 0.026937 -0.0005967 0.0973196 -0.0787674 0.1279701 -0.0395484 -0.257619 0.0177886 0.0006333 0.0249168 0.0586095 0.000425 0.0001642 -0.0000945 0.1050766 0.1012228 0.0285955 -0.0637595 -0.0058568 -0.0056961 0.0967011 -0.0223472 0.1206623 -0.0707309 0.1014189 0.0284967 0.0634391 -0.0059252 -0.0059654 -0.0967656 0.0222516 -0.1205676 -0.0707091 unknown
polarizability: 116.3342273|-2.7672531|73.2385984|-0.0227414|-0.0049196|70.758245 unknown
InChI: InChI=1S/C8H14/c1-5-6-7-8(2,3)4/h5H2,1-4H3
charge 0 multiplicity 1
22 atoms
C  -1.467188 0.049993 0.000421
C  -2.067476 -0.420763 -1.358121
C  -2.122407 -0.752659 1.164095
C  -1.749509 1.570009 0.195537
C  0.000899 -0.183955 0.00098
C  2.682088 -0.599022 -0.00002
C  1.221544 -0.380355 0.000934
C  3.497346 0.72183 -0.001231
H  -1.619931 0.136846 -2.199937
H  -1.878494 -1.497083 -1.518747
H  -3.160836 -0.252127 -1.368012
H  -1.717057 -0.431215 2.139987
H  -1.931824 -1.834724 1.051524
H  -3.216516 -0.587815 1.167552
H  -1.29517 2.162169 -0.61861
H  -1.333778 1.926591 1.154657
H  -2.840437 1.754271 0.196348
H  2.961513 -1.20333 -0.886141
H  2.962897 -1.202714 0.886085
H  4.581458 0.506402 -0.001481
H  3.261343 1.325937 -0.894558
H  3.261935 1.327113 0.891441
