program: Gaussian 09
title: 000138382
version: EM64L-G09RevD.01
frameworkgroup: C1[X(C12H12O)]
method: RPBEPBE
basis: SDD
operation: Freq
keyword: #pfreq=noraman
keyword: PBEPBE/SDD
title: #p freq=noraman PBEPBE/SDD
converged: NO NO NO NO
title: Mulliken charges:
elementType: O C C C C C C C C C C C C H H H H H H H H H H H H
charge: -0.267719 -0.417385 -0.411422 -0.484461 0.404217 0.362197 -0.211215 -0.205627 -0.624769 -0.455973 0.325270 -0.363699 -0.536442 0.251765 0.255254 0.237651 0.237181 0.241120 0.240861 0.254361 0.242080 0.246386 0.218302 0.218571 0.243497
chargesum: 0.00000
title: Mulliken charges with hydrogens summed into heavy atoms:
elementType: O C C C C C C C C C C C C
charge: -0.267719 -0.165620 -0.156168 -0.009628 0.404217 0.362197 0.029906 0.035233 -0.370408 -0.213893 0.325270 -0.117314 0.143927
polarizability: 1.64141553e+02 3.47697244e+00 1.26020966e+02 -5.55194432e-01 -1.35941947e+00 8.09392862e+01
1716.lowfreq: -12.2084 -0.0005 0.0003 0.0005 4.3310 10.9139 69.1676 110.9854 173.6507
frequency: 68.9554 110.9523 173.6487 186.6602 220.9338 296.4397 325.9677 375.5958 415.5785 458.6384 464.1787 517.2539 530.3634 578.4265 619.5107 695.6198 707.8730 737.0417 751.3845 805.4934 827.5048 838.9069 860.0616 878.1956 884.0815 900.5106 914.4322 940.2919 948.9647 957.6583 996.0463 1014.2334 1049.6565 1075.8548 1112.1754 1112.8027 1125.4361 1137.9220 1155.4279 1168.7803 1201.3223 1220.4441 1225.2933 1237.8130 1256.2894 1285.1300 1298.0261 1384.7308 1421.7516 1442.9572 1464.5643 1465.0194 1470.0338 1478.1571 1574.6301 1601.1080 1620.1856 2948.8375 3012.8185 3032.1632 3089.9143 3091.6855 3096.4170 3116.8805 3129.7892 3145.9748 3164.2014 3166.4648 3197.2806
redmass: 3.1119 4.4551 3.8449 3.3621 1.2714 2.7249 3.8957 3.7257 3.2963 3.6806 3.0013 3.2216 2.5902 3.7809 3.5411 4.3760 2.5962 2.9874 4.6243 3.0756 1.9034 2.2360 1.7387 2.2330 2.1622 2.8890 1.8837 3.1042 1.4301 1.8393 4.7780 1.4270 2.4047 1.2221 1.1470 1.2505 1.6091 1.4092 1.3930 2.2347 1.5464 1.5658 1.6146 3.3083 1.4280 1.3755 1.5559 5.7991 1.9970 1.8940 1.1709 1.4258 1.2185 1.1748 5.8236 7.8884 7.2999 1.0336 1.0585 1.1033 1.0892 1.1070 1.0929 1.0986 1.0898 1.0910 1.0873 1.0947 1.1102
irintensity: 4.9936 0.8317 3.5567 2.0150 0.2161 0.9255 2.4970 6.5596 0.7059 2.1314 1.3576 1.5612 5.6822 9.3838 4.4219 13.2307 49.9687 26.3515 3.0356 13.4499 38.7387 15.0030 24.8711 3.4530 6.8964 3.0815 1.9301 1.5118 0.7149 0.3681 38.5713 9.1709 8.8716 0.9349 7.2366 0.6191 21.3316 7.4040 1.0981 29.9605 4.8333 8.6828 11.5325 123.2117 8.6248 8.1710 14.9630 3.0970 27.6499 10.5809 39.2503 61.7415 65.4585 1.4052 2.7070 8.1812 67.0050 67.1299 46.6458 53.9645 48.2514 41.1613 22.0529 29.3845 15.0773 9.3852 5.2605 11.0621 21.3216
temp: 298.150 k
press: 1.00000 atm
elementType: 8 6 6 6 6 6 6 6 6 6 6 6 6 1 1 1 1 1 1 1 1 1 1 1 1
symmnumber: 1
zpe: 536999.7 jmol-1
zpe.correction: 0.204532 hartree
zpe.thermalcorrener: 0.214737 hartree
zpe.thermalcorrenthalpy: 0.215681 hartree
zpe.thermalcorrgfe: 0.168929 hartree
zpe.sumelectzpe: -538.712545 hartree
zpe.sumelectthermal: -538.702341 hartree
zpe.sumelectthermalent: -538.701397 hartree
zpe.sumelectthermalfe: -538.748148 hartree
dipole: 0.3006 -1.7331 0.1953
dipole: 1.7698
quadrupole: -72.1244 -68.4991 -77.8431
quadrupole: 8.0045 -0.3892 -0.3026
quadrupole: 0.6978 4.3231 -5.0209 8.0045 -0.3892 -0.3026
hfenergy: -538.9170774 hartree
pointgroup: C01 [X(C12H12O1)]
dipole: 0.1429898 0.6753325 -0.0910109 debye
dipolederiv: -1.56631 0.5271695 0.0423459 0.4784205 -0.5393149 -0.0143743 0.0701381 -0.0231637 -0.3025721 -0.044991 0.0117285 -0.0211539 0.0119795 0.2123302 -0.0931778 -0.0523758 -0.1069979 -0.0054179 0.0903717 -0.1291841 -0.05139 -0.1300619 0.1563714 0.0412095 -0.0716863 0.0470532 -0.0040966 0.0910206 0.0712808 0.0216073 0.0631126 -0.0930361 0.0275029 0.0137069 0.0249353 0.1537623 0.1878145 -0.0351267 -0.0194598 0.3568821 0.1242452 0.0100428 -0.0098872 0.0659573 -0.0700095 0.1300398 0.0827375 -0.0030821 -0.2552936 -0.3250245 -0.0117334 0.0964104 -0.0276715 -0.1067753 -0.1835234 -0.1244239 0.1622631 -0.1828844 -0.1099625 -0.001596 0.1638908 0.1100871 0.0314453 -0.3076284 0.0218897 0.1202649 0.0625228 0.0094751 0.0956966 0.1793688 -0.0130313 0.0342686 -0.3675985 0.0786752 -0.0018468 -0.2542228 0.0069545 -0.0100166 0.0120815 -0.0288207 -0.2101651 0.1720683 0.0497745 -0.0341696 0.0224481 0.1805109 -0.0215572 -0.0633611 -0.0445656 -0.1480941 1.4370198 -0.4297682 -0.0671159 -0.2975848 0.1298961 0.0134607 -0.0838655 0.0283457 0.104605 -0.3297479 0.0294147 -0.0079676 0.3581198 -0.0964934 -0.0354847 -0.0167048 -0.0035272 -0.1880359 0.4314562 -0.1476523 0.0078393 -0.5178383 0.5868738 0.0138373 0.0370058 -0.010695 0.3299026 0.0313618 0.0441001 -0.0164959 -0.0013917 -0.1378489 0.0662165 0.0008649 0.0732443 0.0412768 -0.0097165 0.0602635 0.0157757 0.101359 -0.1144441 -0.040889 0.0300984 -0.0422297 0.0572574 -0.1952661 -0.0735309 0.0875894 -0.0869581 0.0557069 0.026481 0.0355579 0.0085237 0.0646777 0.0574077 -0.017748 -0.1175893 -0.0101351 0.0759054 -0.0506293 -0.0783855 -0.0380354 -0.1468547 0.1479828 0.0187634 -0.0524267 -0.0039667 0.0192882 -0.1041638 -0.1045693 -0.1176564 -0.0050961 0.124679 0.0305341 -0.101365 0.0496843 0.0645906 0.0494492 -0.1609967 0.0392893 -0.0260639 0.0755574 0.0420812 0.0056194 0.0818861 -0.0714389 0.0157547 -0.0027198 0.0164399 0.1541467 0.0643004 0.076568 0.003378 0.042315 -0.1005733 0.0178152 0.0014198 0.0150815 0.1440465 -0.0087686 -0.0960323 0.0230971 -0.0879285 0.0206142 0.0216311 0.0250916 0.0207244 0.1695469 0.0853251 -0.0483892 0.0826913 0.1108292 -0.0514392 0.0733501 0.002478 0.1110534 -0.1234942 0.0640479 -0.0840974 -0.0995946 0.0916637 -0.0856386 -0.0926704 -0.0508366 -0.1040243 -0.0668192 -0.1769026 0.0409724 0.0211857 -0.0029567 0.0824519 0.0038449 0.0272757 -0.0003163 0.1185589 unknown
polarizability: 163.8134935|-4.9622498|126.2837792|-0.7786517|-2.0909734|81.004533 unknown
InChI: InChI=1S/C12H12O/c1-13-10-4-5-11-8-2-3-9(6-8)12(11)7-10/h2-5,7-9H,6H2,1H3
charge 0 multiplicity 1
25 atoms
O  -3.394644 0.015356 0.156998
C  1.580047 1.328828 -0.402878
C  2.257178 -0.855487 -0.260471
C  2.407517 0.325273 -1.295292
C  0.29533 0.484905 -0.2360
C  0.715467 -0.870222 -0.149032
C  2.37576 1.175199 0.921073
C  2.780057 -0.124024 1.004628
C  -1.054834 0.848355 -0.137181
C  -0.226137 -1.892747 0.041279
C  -2.007992 -0.197168 0.048088
C  -1.598464 -1.549954 0.13589
C  -3.877537 1.390775 0.078356
H  1.446028 2.35452 -0.77595
H  2.738204 -1.813235 -0.505188
H  3.455534 0.644055 -1.431992
H  1.931835 0.112561 -2.269533
H  2.499871 1.965506 1.665308
H  3.302849 -0.610398 1.831846
H  -1.362698 1.896899 -0.203365
H  0.076596 -2.943754 0.112154
H  -2.367983 -2.315094 0.277154
H  -3.62648 1.85586 -0.896135
H  -3.465976 2.014615 0.897157
H  -4.970928 1.322576 0.182287
