program: Gaussian 09
title: 000138380
version: EM64L-G09RevD.01
frameworkgroup: C1[X(C9H14)]
method: RPBEPBE
basis: SDD
operation: Freq
keyword: #p
keyword: freq=noraman
keyword: PBEPBE/SDD
title: #p freq=noraman PBEPBE/SDD
converged: YES YES NO YES
title: Mulliken charges:
elementType: C C C C C C C C C H H H H H H H H H H H H H H
charge: -0.272982 -0.161152 -0.454205 -0.454160 -0.448180 -0.448224 0.501950 -0.444568 -0.854849 0.211072 0.207268 0.222562 0.205310 0.205307 0.222554 0.202576 0.222892 0.222903 0.202576 0.237829 0.222963 0.227594 0.222964
chargesum: 0.00000
title: Mulliken charges with hydrogens summed into heavy atoms:
elementType: C C C C C C C C C
charge: -0.061910 0.046116 -0.026333 -0.026300 -0.022712 -0.022744 0.501950 -0.206739 -0.181328
polarizability: 9.74375314e+01 4.07020768e+00 8.86003054e+01 -1.68788405e-03 -3.57868998e-03 7.87690349e+01
1716.lowfreq: -42.6709 -24.0553 -9.9064 -0.0006 -0.0006 -0.0004 126.5654 153.6748 186.3155
frequency: 126.5276 153.5622 186.3112 255.4995 312.2999 361.3637 393.8142 469.6086 499.7356 615.7656 626.3074 753.7588 790.5265 794.7570 809.2161 815.8878 855.9898 870.3793 936.3567 960.1438 962.7296 1013.5139 1026.3544 1043.7640 1044.6108 1054.6559 1101.0481 1141.6194 1142.6034 1173.6015 1175.6100 1222.7589 1232.8025 1254.1237 1255.4461 1281.9209 1301.3345 1307.1729 1332.4221 1343.3261 1359.8533 1391.6417 1458.8623 1460.9408 1467.7363 1470.4223 1473.0177 1488.5597 1665.7267 2952.7476 2975.2466 2976.7933 2991.5103 2993.3189 3017.5612 3022.8017 3031.2252 3031.6405 3034.9853 3055.4938 3062.6906 3069.2072 3125.8700
redmass: 2.0450 2.1939 1.0326 1.7683 2.2355 2.3232 2.9617 3.8698 3.7384 5.6697 2.6891 3.4290 1.2263 2.8535 1.5772 2.0449 1.8276 2.2961 1.8015 1.7325 3.2614 1.8675 1.6468 2.4114 2.0168 2.0047 1.5601 1.0636 1.2587 1.4240 1.7486 1.1502 1.2212 1.6547 1.4225 1.3648 1.2908 1.4907 1.3539 1.6402 2.0514 1.2642 1.0673 1.0553 1.0691 1.0822 1.0897 1.0916 6.3256 1.0371 1.0602 1.0600 1.0648 1.0629 1.0849 1.0966 1.1022 1.0918 1.0964 1.1035 1.1034 1.0980 1.0950
irintensity: 0.8215 1.6169 0.0315 0.5913 0.1008 0.3118 0.1111 2.8738 0.4925 0.1294 5.3217 0.4232 0.0126 2.0426 19.1126 3.0953 4.5257 15.8475 0.0170 1.5234 2.2336 5.9751 1.1173 4.6062 3.5270 0.6461 0.5016 0.0004 5.5640 3.2682 0.1592 0.0022 1.9479 0.0151 1.5504 0.0513 0.0067 2.6322 1.6470 0.9524 2.9265 10.2284 3.5316 10.0556 16.1875 1.1499 10.4033 5.6877 4.1930 44.5865 49.4517 0.0017 66.5695 76.3108 102.3296 25.8622 0.0356 20.5497 30.1932 60.0583 72.9261 34.4189 26.9448
temp: 298.150 k
press: 1.00000 atm
elementType: 6 6 6 6 6 6 6 6 6 1 1 1 1 1 1 1 1 1 1 1 1 1 1
symmnumber: 1
zpe: 541771.3 jmol-1
zpe.correction: 0.206350 hartree
zpe.thermalcorrener: 0.214492 hartree
zpe.thermalcorrenthalpy: 0.215436 hartree
zpe.thermalcorrgfe: 0.174179 hartree
zpe.sumelectzpe: -350.635815 hartree
zpe.sumelectthermal: -350.627673 hartree
zpe.sumelectthermalent: -350.626729 hartree
zpe.sumelectthermalfe: -350.667986 hartree
dipole: 0.0136 -0.3442 0.0000
dipole: 0.3445
quadrupole: -54.3679 -54.7730 -57.1274
quadrupole: 0.3330 -0.0001 -0.0011
quadrupole: 1.0549 0.6498 -1.7047 0.3330 -0.0001 -0.0011
hfenergy: -350.8421648 hartree
pointgroup: C01 [X(C9H14)]
dipole: 0.0049832 0.1354354 -0.0000977 debye
dipolederiv: -0.0493381 -0.1021169 0.0001701 -0.1107884 0.1438328 -0.0000491 0.0001543 -0.0000814 0.0814568 0.0725456 -0.1155534 0.000142 -0.1304866 0.129886 -0.0000153 0.0001631 0.0000065 0.1006064 0.0933314 0.0483616 -0.044164 0.0399418 0.0330846 0.0010696 -0.0360003 0.0471004 0.0671994 0.0933526 0.0484363 0.0440414 0.0400033 0.0329793 -0.0010167 0.0359318 -0.0470214 0.0672916 0.062955 0.0536517 -0.0256268 0.0555113 0.0448971 -0.0446542 0.0298916 -0.0707273 0.0661337 0.0629728 0.0537598 0.0255075 0.0554613 0.0451558 0.0446745 -0.0300354 0.0707292 0.0658592 0.2497605 -0.0328467 -0.0000827 0.0632976 0.1472702 -0.0003702 -0.0002356 -0.0003156 -0.1755226 0.0131518 0.1068949 -0.000203 0.1045972 -0.050227 -0.0003831 -0.0001881 -0.0003925 -0.3278354 -0.0893764 0.0006196 0.000074 0.0419773 0.0384653 0.0000682 0.0000437 0.0000713 0.1126947 -0.0532534 0.1424002 -0.0001466 0.1244239 -0.1124117 0.0001385 -0.0001195 0.0001308 0.0299479 -0.0218381 0.1084653 -0.0001127 0.1248185 -0.1640168 0.0002044 -0.0001323 0.0002055 0.0375573 -0.0062101 0.0589029 0.1229495 0.0137126 0.0452997 -0.0047072 0.0883867 -0.037037 -0.1331688 -0.0413024 -0.1509578 -0.032553 -0.0983399 -0.1345898 -0.0326149 -0.0068471 0.0023922 0.0627741 -0.0413262 -0.1508884 0.0329027 -0.0983144 -0.1344849 0.0330437 0.0070667 -0.0019545 0.062698 -0.0062492 0.0586607 -0.1231106 0.0135399 0.0453747 0.0043687 -0.0884397 0.0366721 -0.1332114 -0.2231937 -0.010496 -0.0450866 -0.0796085 0.0444675 -0.017566 -0.0058517 -0.0008914 0.060591 0.0663872 -0.0223343 0.0473558 0.029077 -0.023319 0.1110085 0.0027229 0.095074 -0.1365798 0.0663553 -0.02253 -0.0474706 0.0289799 -0.0238048 -0.1112691 -0.0029498 -0.0953142 -0.1360454 -0.2231859 -0.0103586 0.0453134 -0.0795495 0.044531 0.0176494 0.0062379 0.0009413 0.0605125 -0.0121448 -0.0960384 0.0001596 -0.1034617 -0.1007782 0.0003613 0.0001695 0.0003731 0.1788182 -0.0069608 0.0452438 0.0315772 0.0601482 0.0326985 -0.1081603 0.1121951 -0.10787 -0.058586 0.000627 -0.0565154 0.000094 -0.1549057 -0.1175087 0.0003049 0.0002123 0.0002827 0.1057939 -0.0070601 0.0452391 -0.0317305 0.0599649 0.0331984 0.1079144 -0.1123762 0.1076264 -0.0589853 unknown
polarizability: 97.4600998|-4.0455723|88.5777261|-0.0005016|-0.0103064|78.7690457 unknown
InChI: InChI=1S/C9H14/c1-7-6-8-2-4-9(7)5-3-8/h6,8-9H,2-5H2,1H3
charge 0 multiplicity 1
23 atoms
C  -0.382998 1.083513 -0.001367
C  1.011729 -1.106751 0.000886
C  0.541818 1.060198 1.260817
C  0.541392 1.057337 -1.2638
C  1.386245 -0.257156 1.261174
C  1.385612 -0.260168 -1.261625
C  -1.238189 -0.181995 0.000305
C  -0.493796 -1.325581 0.001486
C  -2.745081 -0.097284 0.000685
H  -1.006993 1.99759 -0.002288
H  1.568329 -2.061568 0.001864
H  -0.075831 1.13102 2.174888
H  1.200214 1.950524 1.241484
H  1.199941 1.947594 -1.246486
H  -0.076493 1.126377 -2.177844
H  2.470296 -0.030855 1.240126
H  1.19178 -0.847464 2.174772
H  1.1904 -0.852578 -2.173702
H  2.469706 -0.033983 -1.24185
H  -0.930978 -2.331152 0.002811
H  -3.116492 0.454055 0.888028
H  -3.211522 -1.098795 0.0020
H  -3.11709 0.452022 -0.887665
