program: Gaussian 09
title: 000138379
version: EM64L-G09RevD.01
frameworkgroup: C1[X(C10H12O2)]
method: RPBEPBE
basis: SDD
operation: Freq
keyword: #pfreq=noraman
keyword: PBEPBE/SDD
title: #p freq=noraman PBEPBE/SDD
converged: YES YES NO NO
title: Mulliken charges:
elementType: O O C C C C C C C C C C H H H H H H H H H H H H
charge: -0.144408 -0.150308 0.160144 0.160107 -0.026558 0.020749 -0.514174 -0.514130 -0.514165 -0.514118 -0.439378 -0.439391 0.249667 0.243874 0.243832 0.249680 0.243869 0.249667 0.249680 0.243828 0.238686 0.232077 0.232080 0.238690
chargesum: 0.00000
title: Mulliken charges with hydrogens summed into heavy atoms:
elementType: O O C C C C C C C C C C
charge: -0.144408 -0.150308 0.160144 0.160107 -0.026558 0.020749 -0.020633 -0.020617 -0.020630 -0.020610 0.031385 0.031379
polarizability: 1.31000735e+02 -1.65659288e-04 9.95001989e+01 3.30891953e-05 -6.57644655e-03 8.55843906e+01
1716.lowfreq: -0.0004 0.0001 0.0008 6.5531 12.9053 23.4371 31.9875 70.4545 84.1382
frequency: 31.9843 70.4545 84.0993 131.6877 140.4130 159.8431 169.6406 220.0154 231.8291 275.7483 343.7196 583.4841 615.2965 642.8859 678.1277 707.7264 711.9701 765.7713 771.8330 792.0466 809.0870 843.2661 856.2008 864.2431 895.5470 959.2398 961.0087 962.3339 969.6916 1034.2931 1048.6692 1062.6424 1144.0514 1149.0903 1186.6404 1192.9000 1197.4001 1200.4426 1222.1703 1234.6276 1237.4254 1242.2418 1248.3450 1255.2714 1265.8501 1267.0422 1442.3525 1443.1556 1451.9197 1452.3384 1472.3460 1472.7098 1652.6913 1754.9659 3019.9056 3020.7861 3021.8221 3022.6992 3035.7662 3036.4928 3088.5844 3089.1299 3098.2509 3098.7940 3116.2604 3116.7566
redmass: 5.0276 2.4106 2.4562 3.2306 2.3840 5.8546 3.8406 3.0139 2.2977 9.6301 4.5076 2.6192 13.3265 3.8919 1.7932 3.1943 6.1648 1.8055 1.2849 2.0588 1.4028 2.0175 5.0580 2.4882 5.0096 2.8894 2.5177 2.6619 3.2748 1.0533 3.3262 1.4346 2.5725 2.6022 4.4400 1.2206 1.2119 3.8116 1.3944 1.5902 1.2435 1.2752 1.3946 1.7312 1.3642 1.3659 1.0803 1.0802 1.0992 1.0956 1.1108 1.1076 12.8152 11.8279 1.0570 1.0571 1.0576 1.0574 1.0623 1.0627 1.1089 1.1090 1.1081 1.1084 1.1079 1.1079
irintensity: 5.1458 0.2871 0.0246 0.2714 0.0000 7.0887 0.0000 0.0484 1.2674 9.9897 0.0927 0.8149 0.2160 0.2757 13.0218 1.2730 0.2515 2.8916 0.0000 0.0906 0.6908 2.9868 0.0000 0.0648 0.4862 0.1045 8.3584 0.0005 28.3163 0.0000 0.0052 0.0379 0.4932 2.3002 0.0116 0.0000 2.3437 291.0892 16.0975 0.0203 0.0000 0.7394 1.0399 85.8903 0.0001 11.9893 0.0001 17.5741 5.8643 1.7052 4.5420 1.5364 335.9478 0.8459 0.0020 91.8272 0.2183 9.0157 98.5181 3.7540 8.5720 2.5447 0.0007 16.9328 18.7986 63.4029
temp: 298.150 k
press: 1.00000 atm
elementType: 8 8 6 6 6 6 6 6 6 6 6 6 1 1 1 1 1 1 1 1 1 1 1 1
symmnumber: 1
zpe: 510482.6 jmol-1
zpe.correction: 0.194433 hartree
zpe.thermalcorrener: 0.206031 hartree
zpe.thermalcorrenthalpy: 0.206975 hartree
zpe.thermalcorrgfe: 0.155831 hartree
zpe.sumelectzpe: -537.730497 hartree
zpe.sumelectthermal: -537.718898 hartree
zpe.sumelectthermalent: -537.717954 hartree
zpe.sumelectthermalfe: -537.769099 hartree
dipole: 0.0000 -0.1092 0.0018
dipole: 0.1092
quadrupole: -61.0883 -86.4498 -66.9178
quadrupole: 0.0009 0.0000 -0.0045
quadrupole: 10.3970 -14.9645 4.5675 0.0009 0.0000 -0.0045
hfenergy: -537.9249296 hartree
pointgroup: C01[X(C10H12O2)]
dipole: 0.000018 0.0429434 0.0007461 debye
dipolederiv: -0.4888199 0.0000234 0.0000014 0.0000154 -0.9956582 -0.000242 -0.0000003 -0.0010752 -0.2737685 -0.4832204 0.0000162 0.0000015 0.0000221 -0.9842758 0.0000488 0. -0.0006158 -0.2703563 -1.12041 0.0009175 -0.0001705 -0.0778598 -0.2278677 -0.0002215 -0.0000404 -0.0000453 0.0249328 -1.1203431 -0.0009702 0.0001931 0.0778207 -0.2278506 -0.0002228 0.000085 -0.0000452 0.0249424 1.0149957 -0.0000076 -0.0000069 0.0000136 1.168137 0.000615 -0.000003 0.0010381 -0.0216517 1.0564236 -0.0000107 -0.000008 -0.0000139 1.1239007 0.0000883 -0.0000048 0.000476 -0.0235428 0.2359217 -0.0201432 -0.092218 -0.0073839 0.0709503 -0.0435505 -0.0664623 -0.0593249 0.1231171 0.2358871 -0.0201083 0.0922667 -0.0069429 0.0710028 0.0435011 0.066554 0.0593723 0.1231924 0.2358816 0.020166 0.0922041 0.0074058 0.0709449 -0.0435583 0.0664536 -0.0593439 0.1231227 0.2358714 0.0201334 -0.0922594 0.0069626 0.071004 0.0435079 -0.0665767 0.0593912 0.1232069 0.1814087 -0.0810826 0.0000128 -0.008965 0.1118403 -0.0000029 0.0000275 -0.0000191 -0.0280111 0.1814248 0.0811119 -0.0000155 0.0089547 0.1118114 -0.0000029 -0.0000303 -0.000022 -0.0280128 0.012565 0.0117401 -0.046794 -0.0001593 0.0206236 0.1167015 0.0189215 0.0730817 -0.0831313 0.0130399 0.0256179 0.0138578 0.037401 -0.074097 -0.0898489 0.0403545 -0.0532095 0.0345728 0.0129292 0.0256181 -0.0138711 0.0372479 -0.0741033 0.0898498 -0.0404272 0.053259 0.0345355 0.0126623 0.0117999 0.0468226 -0.0001596 0.020603 -0.1167066 -0.0188922 -0.0730627 -0.08313 0.0130387 -0.0256372 -0.0138638 -0.037419 -0.0741168 -0.0898346 -0.0403533 -0.0531959 0.0345872 0.0125668 -0.0117381 0.046798 0.000164 0.0206417 0.1166931 -0.018918 0.0730726 -0.0831606 0.0126627 -0.0118015 -0.0468326 0.0001591 0.0206217 -0.1166962 0.0188837 -0.0730525 -0.0831579 0.012928 -0.0256335 0.0138762 -0.0372612 -0.0741226 0.0898357 0.0404264 0.0532451 0.0345485 -0.1956503 0.0516647 -0.0000423 0.1129081 0.0526139 0.0000215 -0.0000444 0.000016 0.0766593 0.0619505 -0.0132348 0.0000014 -0.0830323 -0.1276213 0.0000013 0.0000039 0.0000213 0.0719242 0.0619741 0.0131961 -0.0000012 0.0829906 -0.127624 -0.0000005 -0.000005 0.0000217 0.0719235 -0.195688 -0.0516376 0.0000478 -0.1128686 0.052642 0.0000238 0.000048 0.0000172 0.0766576 unknown
polarizability: 131.0007349|-0.0001245|99.5001754|-0.0002962|0.0192213|85.584414 unknown
InChI: InChI=1S/C10H12O2/c11-7-9(3-1-4-9)8(12)10(7)5-2-6-10/h1-6H2
charge 0 multiplicity 1
24 atoms
O  0.0001 -2.407263 -0.001738
O  -0.000073 2.205783 0.001017
C  1.126489 -0.104443 0.000214
C  -1.126471 -0.104527 0.000214
C  0.00005 -1.160132 0.00021
C  -0.000026 0.958632 -0.000101
C  2.262547 -0.05027 -1.095332
C  2.262232 -0.050172 1.096096
C  -2.262549 -0.050374 -1.0953
C  -2.262189 -0.050278 1.096118
C  3.287829 0.392329 0.000507
C  -3.287759 0.392357 0.000555
H  2.081031 0.645694 -1.93006
H  2.462567 -1.062158 -1.488281
H  2.462147 -1.062017 1.489213
H  2.080464 0.645882 1.930693
H  -2.462649 -1.062291 -1.488139
H  -2.081035 0.645498 -1.930106
H  -2.080386 0.645681 1.930786
H  -2.462163 -1.062153 1.48913
H  4.26502 -0.115323 0.00067
H  3.444955 1.483315 0.000473
H  -3.444701 1.48337 0.000523
H  -4.26503 -0.11514 0.000738
