program: Gaussian 09
title: 000138378
version: EM64L-G09RevD.01
frameworkgroup: C1[X(C10H8O2)]
method: RPBEPBE
basis: SDD
operation: Freq
keyword: #pfreq=noraman
keyword: PBEPBE/SDD
title: #p freq=noraman PBEPBE/SDD
converged: NO YES NO NO
title: Mulliken charges:
elementType: O O C C C C C C C C C C H H H H H H H H
charge: -0.253801 -0.226166 0.346916 -0.374029 -0.380901 -0.213958 -0.211776 -0.230641 0.023143 -0.097054 0.176033 -0.500564 0.257596 0.256879 0.235736 0.235087 0.235577 0.234813 0.243572 0.243540
chargesum: 0.00000
title: Mulliken charges with hydrogens summed into heavy atoms:
elementType: O O C C C C C C C C C C
charge: -0.253801 -0.226166 0.346916 -0.116433 -0.124022 0.021777 0.023311 0.004936 0.023143 -0.097054 0.176033 0.221360
polarizability: 2.32850610e+02 3.91353291e+00 1.06202722e+02 -3.89261206e-02 1.04978345e-02 4.86256739e+01
1716.lowfreq: -3.9033 0.0003 0.0006 0.0009 4.7380 5.3367 28.8674 47.6285 59.6253
frequency: 28.8560 47.5250 59.6225 117.6200 141.6474 149.7014 237.7377 275.5572 292.5013 393.4641 400.3082 485.2502 548.6726 552.9291 587.9222 618.1265 694.7013 696.0471 731.0223 777.6425 831.0752 856.1292 936.9732 960.9177 984.7185 986.6258 1004.1080 1025.5647 1081.2366 1107.8805 1124.0899 1146.1291 1176.0907 1189.3426 1295.9003 1313.9047 1371.8181 1420.2499 1434.0033 1451.8664 1461.0567 1481.0241 1573.6188 1593.3062 1612.3943 2248.8521 3003.2731 3105.0295 3132.7739 3142.2244 3149.8766 3153.5598 3163.5277 3173.5508
redmass: 5.0813 5.0007 4.6748 1.2056 2.9314 5.6930 5.9233 6.9892 4.3462 5.1102 2.8199 7.7239 8.7957 4.0494 7.9410 6.6738 1.9692 8.4968 5.9391 1.7387 7.0214 1.2463 1.4234 8.6593 1.3860 6.2941 1.3300 2.1809 1.6039 1.2639 6.1513 1.4309 1.0574 1.1232 4.1413 1.3916 5.7129 1.1913 2.3415 1.0501 1.0525 2.3924 5.6204 8.2889 6.9011 11.9960 1.0295 1.1046 1.0853 1.0883 1.1046 1.0931 1.0972 1.1017
irintensity: 1.5857 1.6800 1.3710 0.5626 2.1219 1.5572 3.4624 7.8069 11.6531 2.2999 0.0009 2.1368 0.0936 9.7524 10.8521 0.0453 31.1380 34.9336 4.6401 64.0630 18.1706 0.0025 5.7160 28.4822 0.0012 6.1126 0.1218 1.1140 7.8659 0.0470 542.8476 29.3146 0.0082 1.0913 123.7039 1.0310 0.4378 27.4376 11.0154 14.3859 11.2643 27.9492 0.7791 230.6263 71.0373 366.3526 39.7733 26.7658 0.3364 3.3348 16.3457 15.0146 22.5354 18.0042
temp: 298.150 k
press: 1.00000 atm
elementType: 8 8 6 6 6 6 6 6 6 6 6 6 1 1 1 1 1 1 1 1
symmnumber: 1
zpe: 391953.7 jmol-1
zpe.correction: 0.149287 hartree
zpe.thermalcorrener: 0.160586 hartree
zpe.thermalcorrenthalpy: 0.161530 hartree
zpe.thermalcorrgfe: 0.110068 hartree
zpe.sumelectzpe: -535.406996 hartree
zpe.sumelectthermal: -535.395698 hartree
zpe.sumelectthermalent: -535.394753 hartree
zpe.sumelectthermalfe: -535.446215 hartree
dipole: -2.1337 -1.8338 0.0033
dipole: 2.8134
quadrupole: -47.6401 -67.7801 -71.9351
quadrupole: -8.0704 -0.0015 -0.0115
quadrupole: 14.8117 -5.3284 -9.4834 -8.0704 -0.0015 -0.0115
hfenergy: -535.5562832 hartree
pointgroup: C01 [X(C10H8O2)]
dipole: -0.8425337 -0.7120142 0.0915563 debye
dipolederiv: -1.3393038 0.3428323 0.0023668 0.8816575 -0.8672327 0.0219499 -0.0464171 0.0395388 -0.3033361 -1.0041014 -0.2676789 0.0453359 -0.2267079 -0.8806986 0.0565561 0.0408252 0.0566404 -0.3307246 -0.1048759 -0.0144654 0.0055919 -0.008237 0.0551667 -0.0020063 0.0053413 -0.0017566 0.0290314 0.0086151 0.1070046 -0.0144607 -0.1287622 0.0432418 -0.0120297 0.0064906 -0.019664 -0.1380216 0.0086779 -0.1082789 0.0046406 0.1227591 0.0391139 -0.0198077 -0.015548 -0.0122269 -0.1381615 -0.0887445 -0.1537898 0.011913 -0.2100176 0.0356876 -0.0086369 0.0169376 -0.0105015 -0.1391476 -0.1373678 0.1303328 -0.011772 0.1866026 0.0791152 -0.0256963 -0.0169095 -0.024069 -0.1378315 0.0685536 0.0052539 -0.0076065 0.0036295 -0.0022311 -0.0128185 -0.0072656 -0.0128352 -0.1445206 0.9453341 0.0480607 -0.0347809 0.0837515 -0.0678221 0.0049061 -0.0386748 0.0059591 0.0191195 -1.7107039 -0.0426261 0.0552148 -0.1119957 -0.1851158 0.0098434 0.0618938 0.0076844 -0.1160961 2.6717343 -0.0107282 -0.0741121 -0.4720333 1.5159861 -0.0917819 -0.0322275 -0.1056906 0.3177079 0.756913 -0.1510173 -0.0015952 -0.1218922 0.252094 0.0062771 -0.0034407 0.0069009 0.279865 0.0703218 -0.0737819 0.0094813 -0.0552978 -0.0237326 0.0179252 0.0078469 0.0185029 0.1562133 0.0507966 0.0846588 -0.0039223 0.067649 -0.0076914 0.0124329 -0.0024517 0.0118638 0.1568151 -0.0033107 0.0862157 -0.0022116 0.1115632 -0.0429812 0.0144297 -0.0045201 0.0153084 0.1601494 0.0227307 -0.0744005 0.0111844 -0.1017178 -0.0677526 0.0236986 0.0136883 0.0229202 0.1586303 -0.1247304 -0.01368 0.010637 -0.014228 0.091206 0.0065853 0.0107206 0.0065588 0.1593839 0.0198963 0.0475733 -0.0010325 0.1219727 -0.0888851 0.015031 -0.0077101 0.0173559 0.1211704 -0.0579538 0.0249723 -0.0290962 -0.0733468 0.0469999 -0.1052579 -0.0621143 -0.073783 -0.0379574 -0.0524813 0.0335425 0.0242243 -0.0553488 0.075532 0.0883998 0.0735352 0.0512933 -0.0722891 unknown
polarizability: 232.6944475|2.750914|105.7032738|-6.206541|-5.1383479|49.2812849 unknown
InChI: InChI=1S/C10H8O2/c1-12-10(11)8-7-9-5-3-2-4-6-9/h2-6H,1H3
charge 0 multiplicity 1
20 atoms
O  3.460703 -0.860105 -0.146533
O  3.418569 1.47301 -0.34973
C  -1.281305 0.049742 -0.075028
C  -2.086107 1.224972 -0.152402
C  -1.914646 -1.221412 0.058638
C  -3.490628 1.12624 -0.096766
C  -3.319894 -1.310008 0.113113
C  -4.111676 -0.138991 0.035742
C  0.145826 0.143774 -0.130844
C  1.381301 0.211346 -0.176779
C  2.808598 0.379145 -0.235956
C  4.942571 -0.786319 -0.197481
H  -1.598696 2.200013 -0.254941
H  -1.295299 -2.122296 0.11791
H  -4.102112 2.032877 -0.156877
H  -3.799466 -2.289278 0.216197
H  -5.203962 -0.211831 0.078347
H  5.274003 -1.830744 -0.114711
H  5.323975 -0.178102 0.640053
H  5.270345 -0.337035 -1.150153
