program: Gaussian 09
title: 000138373
version: EM64L-G09RevD.01
frameworkgroup: C1[X(C9H14)]
method: RPBEPBE
basis: SDD
operation: Freq
keyword: #p
keyword: freq=noraman
keyword: PBEPBE/SDD
title: #p freq=noraman PBEPBE/SDD
converged: YES YES NO NO
title: Mulliken charges:
elementType: C C C C C C C C C H H H H H H H H H H H H H H
charge: -0.109850 -0.109852 -0.481853 -0.444491 -0.444493 -0.616142 -0.616150 0.601899 -0.787599 0.217096 0.217095 0.212306 0.214561 0.209446 0.216782 0.216787 0.209449 0.205461 0.220992 0.220995 0.205462 0.221050 0.221050
chargesum: 0.00000
title: Mulliken charges with hydrogens summed into heavy atoms:
elementType: C C C C C C C C C
charge: 0.107246 0.107243 -0.054986 -0.018263 -0.018257 -0.189689 -0.189694 0.601899 -0.345499
polarizability: 1.00892982e+02 -3.49570003e-05 8.51468365e+01 8.62413112e+00 -9.48240272e-05 8.15941336e+01
1716.lowfreq: -15.4111 -4.9202 0.0002 0.0004 0.0004 27.6500 102.5316 138.0388 305.9470
frequency: 102.5061 137.9023 305.9390 341.7403 363.2353 389.1989 434.9931 449.3103 562.8794 694.1448 718.1615 731.4611 776.2082 806.4548 810.5858 872.1219 878.5591 888.4786 924.2520 945.2550 945.8583 979.5409 1000.4398 1005.2413 1019.2102 1053.7240 1093.0544 1096.5330 1143.5014 1152.1225 1177.8043 1194.2970 1227.9230 1250.2337 1278.2974 1282.4218 1283.1628 1286.7700 1312.6178 1317.1750 1337.5555 1347.4946 1433.3443 1451.3250 1458.4141 1464.5937 1468.7940 1484.6200 1666.1339 2948.7784 2952.5249 2983.0861 2989.0974 3002.2802 3016.4935 3025.6228 3028.5451 3035.1128 3045.4421 3048.9789 3071.1969 3080.8713 3182.2004
redmass: 3.0336 1.9433 1.9259 2.1198 3.1810 2.1939 2.9754 1.6015 3.4727 1.2251 2.9131 3.2644 1.4136 2.4036 3.6739 2.3897 2.7192 1.6069 1.4917 1.6237 1.6828 1.8667 1.6867 2.1543 2.3034 1.3478 1.7268 1.1195 1.1594 1.1225 1.1931 1.3584 1.4159 1.5541 1.7543 1.7467 1.7308 1.4416 1.4955 1.5372 1.4049 1.7919 1.1577 1.0883 1.1103 1.0799 1.0898 1.0960 5.4840 1.0638 1.0643 1.0610 1.0608 1.0649 1.0864 1.0917 1.0947 1.0906 1.1034 1.1038 1.1046 1.0624 1.1137
irintensity: 0.0732 0.0842 0.1432 0.5595 2.0126 0.3812 0.1998 1.7659 3.0404 0.0976 0.2808 0.2518 3.8556 3.9306 2.5643 2.6738 0.0236 0.0295 47.5442 34.3413 0.0552 1.7672 0.0036 1.0011 7.9668 0.0002 2.4168 1.7434 0.0451 2.3137 0.5570 0.0042 4.7698 1.2717 1.3386 0.0232 3.8070 0.9321 2.6100 1.4599 0.9827 3.2008 3.3051 8.2186 13.5326 7.6718 20.0328 2.4024 27.6278 22.5067 43.9485 31.4179 11.3394 76.5126 80.8797 57.3079 76.2383 6.9197 0.0308 42.9005 78.8958 10.2148 22.6347
temp: 298.150 k
press: 1.00000 atm
elementType: 6 6 6 6 6 6 6 6 6 1 1 1 1 1 1 1 1 1 1 1 1 1 1
symmnumber: 1
zpe: 542840.4 jmol-1
zpe.correction: 0.206757 hartree
zpe.thermalcorrener: 0.214489 hartree
zpe.thermalcorrenthalpy: 0.215433 hartree
zpe.thermalcorrgfe: 0.174907 hartree
zpe.sumelectzpe: -350.634550 hartree
zpe.sumelectthermal: -350.626818 hartree
zpe.sumelectthermalent: -350.625874 hartree
zpe.sumelectthermalfe: -350.666400 hartree
dipole: -0.7041 0.0000 -0.2870
dipole: 0.7604
quadrupole: -57.0958 -54.4537 -56.7595
quadrupole: 0.0000 0.7959 0.0000
quadrupole: -0.9928 1.6493 -0.6565 0.0000 0.7959 0.0000
hfenergy: -350.8413072 hartree
pointgroup: C01 [X(C9H14)]
dipole: 0.2722583 -0.0000583 -0.1239622 debye
dipolederiv: 0.1800595 0.0323575 -0.0066535 0.0213137 0.1147296 0.0109908 0.0008077 -0.028924 0.0817034 0.1800386 -0.0323791 -0.0066422 -0.0213322 0.1147562 -0.011007 0.0008201 0.028911 0.0816922 0.0591971 -0.0000109 0.0095754 -0.0000052 -0.0364646 0.0000163 0.0304496 0.0000143 0.0525944 0.1049377 0.0422536 -0.0274132 0.0545442 0.0225805 0.0234442 -0.0314192 0.0386002 -0.0113664 0.1049005 -0.04229 -0.0273996 -0.0545857 0.0225722 -0.0234441 -0.0313899 -0.0386061 -0.0113481 -0.0229527 -0.0602719 0.0325031 -0.0140881 0.0111714 0.0113385 0.0617177 0.0399129 0.1100703 -0.0229327 0.0602959 0.0324771 0.0141225 0.0111279 -0.0113074 0.0617021 -0.0398914 0.1100936 0.146896 -0.0000259 -0.1679936 -0.0000491 0.2125726 -0.0000106 -0.2816879 0.0000057 0.054663 -0.352047 0.0000318 -0.1030843 0.0000397 0.0523168 -0.0000742 -0.0722534 -0.0000792 -0.3742332 -0.0353847 -0.0962721 0.0335888 -0.0896746 -0.1746375 0.0692855 0.020583 0.0695722 0.0317874 -0.0353347 0.0962485 0.0335283 0.0896449 -0.1747478 -0.0692023 0.0205245 -0.0694846 0.0318467 0.0670706 -0.0000277 -0.1146322 -0.0000128 0.0478807 -0.0000389 -0.044736 -0.0000485 -0.195185 -0.2343442 0.0000481 0.0510191 0.0000363 0.0389664 0.0000014 -0.0001707 0.000008 0.0743675 0.0081575 0.084682 0.1273748 0.0477462 0.003001 -0.054295 0.081706 -0.0685543 -0.0525568 -0.1609411 -0.104469 -0.0987858 -0.0677106 0.0000592 -0.0287659 -0.0573035 -0.0099451 0.0452278 -0.1608665 0.1044762 -0.0988391 0.067741 0.0000198 0.0288283 -0.0573492 0.0099962 0.0451975 0.0080997 -0.084629 0.1274342 -0.0477169 0.003104 0.0542157 0.081756 0.0684908 -0.0525916 0.0266125 -0.0104881 -0.0208342 -0.0469823 0.0510974 0.035282 -0.0426016 0.0833016 -0.1729653 -0.0149067 0.0834062 0.0543535 0.0565295 -0.0993819 -0.0538941 0.0624305 -0.1287498 0.0238919 -0.0149448 -0.0834077 0.0544022 -0.0565271 -0.0992672 0.0539296 0.0624892 0.1287831 0.0238161 0.0266305 0.010485 -0.0208468 0.0469717 0.0510332 -0.0353677 -0.0426431 -0.0833825 -0.1729173 0.071007 -0.0494635 0.0684522 -0.1022759 -0.0862041 0.0574575 0.0883109 0.0400004 0.1380853 0.0710479 0.0494501 0.0684161 0.1022706 -0.0862858 -0.0573826 0.0882571 -0.0399308 0.1381265 unknown
polarizability: 100.1685162|-0.0039144|85.1468372|-9.371879|0.0006853|82.3185983 unknown
InChI: InChI=1S/C9H14/c1-7-4-8-2-3-9(5-7)6-8/h8-9H,1-6H2
charge 0 multiplicity 1
23 atoms
C  0.830124 1.196445 -0.323533
C  0.829796 -1.19677 -0.323014
C  1.370338 -0.000416 -1.150516
C  1.199378 0.786554 1.137423
C  1.199113 -0.786341 1.137787
C  -0.713414 1.288941 -0.517465
C  -0.713769 -1.288925 -0.516926
C  -1.406345 0.000194 -0.082226
C  -2.538507 0.000506 0.668991
H  1.293807 2.157236 -0.614839
H  1.29322 -2.157815 -0.613893
H  1.015656 -0.000598 -2.198655
H  2.477699 -0.000571 -1.161984
H  0.477746 1.198015 1.866081
H  2.198732 1.177569 1.403953
H  2.198307 -1.177578 1.404579
H  0.477272 -1.197212 1.866572
H  -0.915833 1.476089 -1.594184
H  -1.126763 2.148264 0.043673
H  -1.127356 -2.147903 0.044566
H  -0.916228 -1.476459 -1.59357
H  -3.021013 -0.932995 0.983785
H  -3.02076 0.93427 0.983395
