program: Gaussian 09
title: 000138370
version: EM64L-G09RevD.01
frameworkgroup: C1[X(C7H12)]
method: RPBEPBE
basis: SDD
operation: Freq
keyword: #p
keyword: freq=noraman
keyword: PBEPBE/SDD
title: #p freq=noraman PBEPBE/SDD
converged: YES YES NO NO
title: Mulliken charges:
elementType: C C C C C C C H H H H H H H H H H H H
charge: -0.505627 0.441866 -0.687573 -0.818111 -0.370923 -0.074409 -0.596759 0.215256 0.201936 0.218376 0.218358 0.226211 0.233543 0.227663 0.222223 0.219309 0.206095 0.210501 0.212064
chargesum: 0.00000
title: Mulliken charges with hydrogens summed into heavy atoms:
elementType: C C C C C C C
charge: -0.088435 0.441866 -0.024627 -0.134681 -0.151614 0.131687 -0.174195
polarizability: 1.31083723e+02 -1.32425395e+01 7.10937284e+01 5.35041219e+00 1.34823224e+00 4.94572181e+01
1716.lowfreq: -17.9988 -7.0584 -0.0006 -0.0003 0.0005 12.6140 44.8312 99.2811 143.2227
frequency: 44.6814 99.2581 143.2005 172.1199 187.8057 249.3568 291.3407 358.1937 424.0715 476.8049 559.2923 662.5466 780.1866 789.5599 896.9507 921.3522 929.9714 975.7497 991.3566 1006.3016 1022.4498 1071.4427 1089.8381 1162.1975 1228.4265 1249.4341 1291.4382 1315.0920 1348.6712 1385.7039 1395.7690 1432.3773 1459.3211 1465.5414 1474.9821 1479.6994 1487.3863 1609.6016 1664.1598 2956.2084 2967.2495 2981.7651 3029.4728 3035.1383 3077.1005 3078.2262 3083.6170 3089.7632 3096.4232 3108.1375 3201.1492
redmass: 2.2115 1.3216 1.8517 1.6429 1.8032 1.4557 2.4180 2.5293 2.4560 2.8639 2.5228 1.3837 1.1670 2.7429 1.4167 1.7780 1.4351 1.5334 1.1552 1.6842 1.4652 1.8786 1.5428 2.4329 1.8450 1.1876 1.3200 1.5454 1.4943 1.2178 1.2353 1.2904 1.0687 1.0665 1.0704 1.0499 1.0629 4.1579 5.8572 1.0634 1.0395 1.0350 1.0965 1.0962 1.0932 1.0949 1.1001 1.0640 1.0926 1.0915 1.1143
irintensity: 0.0107 1.3597 0.0974 0.8581 0.4885 0.3778 0.2490 1.3600 2.0556 2.6398 5.3336 11.8500 5.2716 0.7431 1.3988 2.3052 98.5102 3.9310 18.6382 6.3529 3.4675 20.7432 8.3177 0.2537 7.1828 0.3527 1.0907 2.3350 0.4170 9.5799 22.5115 11.3746 2.2281 15.4354 20.6737 13.0829 6.9393 5.1675 40.8659 40.2319 34.5538 44.7486 13.6409 27.3197 5.2829 54.5232 44.2117 23.7678 13.3499 31.7193 29.1478
temp: 298.150 k
press: 1.00000 atm
elementType: 6 6 6 6 6 6 6 1 1 1 1 1 1 1 1 1 1 1 1
symmnumber: 1
zpe: 438418.7 jmol-1
zpe.correction: 0.166985 hartree
zpe.thermalcorrener: 0.176007 hartree
zpe.thermalcorrenthalpy: 0.176952 hartree
zpe.thermalcorrgfe: 0.133160 hartree
zpe.sumelectzpe: -273.348139 hartree
zpe.sumelectthermal: -273.339117 hartree
zpe.sumelectthermalent: -273.338172 hartree
zpe.sumelectthermalfe: -273.381964 hartree
dipole: -1.0401 0.3358 -0.0200
dipole: 1.0931
quadrupole: -43.4178 -41.6067 -47.7722
quadrupole: 0.1014 1.0363 0.8937
quadrupole: 0.8478 2.6589 -3.5067 0.1014 1.0363 0.8937
hfenergy: -273.515124 hartree
pointgroup: C01 [X(C7H12)]
dipole: -0.4059852 -0.1380748 -0.0327906 debye
dipolederiv: -0.0155051 0.0529926 -0.0082114 -0.0354747 0.0670381 -0.0243682 -0.1020074 -0.0556454 0.0992756 0.3702848 0.0320138 -0.0379049 0.1881415 0.257111 0.1279422 -0.0049585 0.1809151 -0.0796901 -0.0189483 0.0201786 -0.0605234 0.0754957 0.0848113 0.0086736 0.0631179 0.0103781 0.0188773 -0.0634006 -0.024963 0.0027269 0.0307581 -0.1179499 -0.0961987 -0.0062403 -0.119986 0.0382955 -0.287262 -0.0129039 -0.0224629 -0.0577539 -0.0447507 0.0775601 -0.0085647 0.0605355 -0.1519134 0.3869361 0.075969 -0.0325264 -0.115235 0.0634068 0.0835273 -0.1166135 0.0603841 -0.0606961 -0.348702 -0.0972304 -0.0699337 -0.0954941 0.0003868 0.2068538 -0.0508229 0.2093024 -0.3573356 0.0235117 -0.0591502 -0.0604302 0.00675 -0.1152502 -0.120089 -0.0248099 -0.084657 0.014528 -0.0694059 -0.0457883 0.0784046 -0.0398734 -0.0078698 0.1329698 0.1088643 0.0970263 -0.0604987 0.0854526 -0.0482752 -0.0372329 -0.1003058 -0.1086809 -0.1019107 -0.0573227 -0.0723528 0.0214262 -0.1783127 0.1102404 0.0453692 0.1413452 0.0334704 -0.0323763 0.0544368 -0.0493337 0.0491453 0.0623329 -0.0725532 0.0796614 -0.0424207 0.0131854 0.1060416 0.0157042 0.1035684 -0.0600081 0.0366508 -0.0211363 -0.1176874 -0.054417 0.0602749 0.0195508 -0.1528992 -0.0322877 -0.076584 -0.0705061 0.155159 0.0402166 0.0782824 0.0245851 -0.0285764 0.0335525 -0.0228148 0.0951348 0.0077103 -0.1076952 0.092692 -0.1242072 -0.0050358 0.0399462 0.1067634 0.1030221 0.0024913 0.0344065 -0.0110188 0.0142958 0.0376801 -0.0971418 -0.1092244 0.03185 -0.1015606 0.1006758 0.0649291 -0.0210433 0.0040658 0.0550381 -0.0922312 -0.110554 0.0297464 -0.1027119 0.1063693 -0.0933084 0.0483015 0.0591801 0.0630016 0.062024 -0.063503 0.0670408 -0.0600784 0.1540315 0.0731363 0.0269028 0.0303008 -0.011311 -0.0773835 -0.1162647 0.0131629 -0.1237037 0.1464753 unknown
polarizability: 130.5522504|15.2315046|69.7457596|-0.4923637|6.5802737|51.336659 unknown
InChI: InChI=1S/C7H12/c1-4-6-7(3)5-2/h4,6H,1,5H2,2-3H3
charge 0 multiplicity 1
19 atoms
C  -1.770744 0.427236 0.63451
C  -0.491378 -0.255493 0.16655
C  -2.801327 0.67477 -0.500551
C  -0.659925 -1.653408 -0.40101
C  0.715674 0.392785 0.270308
C  2.028185 -0.112118 -0.134283
C  3.193497 0.589784 -0.005136
H  -1.521941 1.393995 1.111831
H  -2.255271 -0.198805 1.413993
H  -3.143231 -0.272775 -0.954482
H  -3.692214 1.197443 -0.106822
H  -2.362161 1.298296 -1.300224
H  -1.189789 -1.628226 -1.373756
H  0.298459 -2.172727 -0.559748
H  -1.275842 -2.274939 0.278186
H  0.714779 1.405928 0.701568
H  2.076264 -1.119335 -0.571365
H  4.155234 0.172107 -0.32127
H  3.20953 1.601282 0.420199
