program: Gaussian 09
title: 000138369
version: EM64L-G09RevD.01
frameworkgroup: C1[X(C13H15IO5)]
method: RPBEPBE
basis: SDD
operation: Freq
keyword: #p
keyword: freq=noraman
keyword: PBEPBE/SDD
title: #p freq=noraman PBEPBE/SDD
converged: YES YES NO NO
title: Mulliken charges:
elementType: I O O O O O C C C C C C C C C C C C C H H H H H H H H H H H H H H H
charge: 0.141657 -0.266381 -0.272263 -0.222263 -0.284736 -0.243675 -0.310367 -0.242259 0.344480 0.260207 -0.473972 -0.309023 0.163502 -0.259312 -0.352534 -0.206467 -0.675686 0.178608 -0.498562 0.244034 0.226343 0.229596 0.195186 0.293782 0.294459 0.277447 0.187581 0.191650 0.204104 0.229574 0.228555 0.245122 0.236318 0.245294
chargesum: 0.00000
title: Mulliken charges with hydrogens summed into heavy atoms:
elementType: I O O O O O C C C C C C C C C C C C C
charge: 0.141657 -0.266381 -0.272263 -0.222263 -0.284736 -0.243675 0.160010 0.182523 0.344480 0.260207 -0.473972 -0.015240 0.163502 0.035148 -0.075087 0.172764 -0.013453 0.178608 0.228172
polarizability: 2.42101870e+02 -1.37642394e+01 2.31186551e+02 1.37268424e+01 9.75769124e+00 9.94499246e+01
1716.lowfreq: -2.7471 0.0004 0.0006 0.0007 4.0107 5.9180 12.8552 18.1571 31.5769
frequency: 12.2665 18.0609 31.5635 44.3376 49.4572 65.8279 82.0067 92.8330 97.8019 101.2902 117.4299 144.7910 168.4525 173.2984 200.9030 223.6255 235.8569 248.3899 269.5325 291.6242 310.5165 357.9163 407.9807 426.2262 439.0004 483.2030 492.5802 525.3455 528.5340 645.1337 665.3476 689.2990 717.7790 745.1435 769.8442 793.6588 808.3079 815.2850 848.3444 881.5097 923.3287 929.9183 937.9426 993.9574 1006.2609 1016.5557 1040.3272 1066.0363 1077.8076 1085.1137 1093.6423 1114.3836 1125.9342 1140.6907 1145.8681 1153.0513 1207.6394 1227.6892 1243.4259 1251.7046 1270.3593 1276.6626 1337.8495 1360.3104 1366.6423 1376.4871 1389.3441 1405.1878 1423.8563 1432.1399 1452.1305 1459.7407 1462.4739 1466.6428 1467.4069 1480.0577 1493.9039 1546.9843 1602.5911 1622.9655 1627.3521 2915.2537 2923.8250 2966.1399 2983.5602 2995.1515 3006.4411 3039.4375 3093.1841 3101.9828 3108.8641 3124.3777 3152.6288 3163.5525 3185.2433 3189.8502
redmass: 5.1850 4.3096 3.4909 5.7247 2.5770 3.4180 5.3354 2.3029 1.8750 5.2495 3.7748 3.3712 4.9051 4.0925 5.7635 6.4809 1.2079 4.0550 6.9762 5.3529 6.7900 3.4696 2.7314 4.1528 3.6755 6.1015 4.2581 4.3673 4.9816 7.4020 6.3768 6.4466 4.5402 4.6227 5.1751 3.7387 4.3285 1.1004 3.5007 1.4768 7.8701 2.3706 1.4583 2.8852 1.3734 4.1365 2.7812 4.2182 4.4023 2.5917 3.4917 1.2639 2.1034 1.5149 1.3981 1.4434 1.1672 2.8176 3.3420 1.1449 1.3264 1.2986 1.2413 3.3027 1.3525 5.2640 1.2465 1.4561 1.1891 1.1009 1.0496 1.0409 1.0523 1.2066 2.1833 1.0473 1.0799 8.0666 6.7821 10.5776 10.2428 1.0573 1.0583 1.1062 1.0996 1.0358 1.0296 1.0605 1.0991 1.1010 1.1046 1.1055 1.1049 1.0896 1.0955 1.0932
irintensity: 0.1797 0.2204 2.7368 0.4994 1.7924 1.3632 1.3224 1.9990 1.1318 0.8416 2.6841 8.2337 2.6677 4.8229 3.4928 2.7892 1.0215 0.1927 0.9993 27.3591 5.3662 7.6043 5.3828 7.6836 2.4414 5.6485 10.0459 7.4231 1.0110 5.4870 5.9308 19.4371 40.6794 5.7135 1.3606 2.0227 12.8437 4.9948 4.1510 22.5336 18.5096 32.6449 14.5105 34.4934 0.4741 231.1199 45.1997 231.2384 183.7530 48.2295 33.4039 0.0248 12.7506 2.6478 12.8090 57.4175 96.5563 382.7436 136.1461 0.6461 34.8129 30.4317 30.5876 18.0551 4.1616 20.3351 19.6038 6.8940 31.3436 22.6180 15.0968 10.7344 13.6215 30.5810 35.4878 2.6065 5.7239 51.5548 12.7280 327.7913 11.8366 27.7223 107.3516 70.9787 37.8594 21.8754 37.2963 38.9743 35.5300 38.6726 24.4555 7.3597 13.2049 0.5086 0.1551 0.4358
temp: 298.150 k
press: 1.00000 atm
elementType: 53 8 8 8 8 8 6 6 6 6 6 6 6 6 6 6 6 6 6 1 1 1 1 1 1 1 1 1 1 1 1 1 1 1
symmnumber: 1
zpe: 676321.7 jmol-1
zpe.correction: 0.257597 hartree
zpe.thermalcorrener: 0.278357 hartree
zpe.thermalcorrenthalpy: 0.279302 hartree
zpe.thermalcorrgfe: 0.202424 hartree
zpe.sumelectzpe: -890.564841 hartree
zpe.sumelectthermal: -890.544081 hartree
zpe.sumelectthermalent: -890.543137 hartree
zpe.sumelectthermalfe: -890.620015 hartree
dipole: 0.7494 0.4808 -0.7466
dipole: 1.1620
quadrupole: -87.6908 -134.0005 -125.1267
quadrupole: -2.7560 -1.4339 -5.3568
quadrupole: 27.9152 -18.3945 -9.5207 -2.7560 -1.4339 -5.3568
hfenergy: -890.8224386 hartree
pointgroup: C01 [X(C13H15I1O5)]
dipole: 0.2721913 -0.3594734 -0.0754587 debye
polarizability: 244.7868334|23.4130665|120.9952682|0.2780701|46.9530438|206.9562434 unknown
InChI: InChI=1S/C13H15IO5/c1-3-18-6-7-19-13(16)10-5-4-9(8-11(10)14)12(15)17-2/h4-5,8H,3,6-7H2,1-2H3
charge 0 multiplicity 1
34 atoms
I  -1.202331 1.370115 3.603128
O  2.050266 1.1894 0.025526
O  4.451549 -0.355127 -0.882416
O  1.705326 0.987868 2.322262
O  -5.002902 -0.712666 0.298611
O  -4.205433 -1.312352 -1.807365
C  3.476438 1.521846 0.290013
C  4.33686 0.271462 0.433956
C  -0.118407 0.508223 0.739463
C  -2.672931 -0.374484 -0.155304
C  -1.249738 0.573382 1.602903
C  -0.302496 -0.002518 -0.579196
C  1.265552 0.910683 1.151237
C  -2.516073 0.140041 1.154633
C  -1.557142 -0.443524 -1.025546
C  5.248002 -1.59191 -0.845868
C  5.300193 -2.146942 -2.268445
C  -3.997904 -0.847174 -0.660196
C  -6.352415 -1.155889 -0.124709
H  3.782994 2.100356 -0.594753
H  3.537005 2.132365 1.208063
H  3.893187 -0.427424 1.174716
H  5.341473 0.576163 0.808977
H  0.570297 -0.042638 -1.235336
H  -3.388814 0.196619 1.808457
H  -1.695001 -0.840293 -2.035733
H  6.270916 -1.368948 -0.466459
H  4.777041 -2.321071 -0.149287
H  5.888814 -3.081892 -2.296732
H  4.28202 -2.361519 -2.635917
H  5.767275 -1.416547 -2.951246
H  -6.692707 -0.563296 -0.990393
H  -6.991769 -0.982908 0.751812
H  -6.333343 -2.223298 -0.401357
