program: Gaussian 09
title: 000138368
version: EM64L-G09RevD.01
frameworkgroup: C1[X(C6H12O)]
method: RPBEPBE
basis: SDD
operation: Freq
keyword: #pfreq=noraman
keyword: PBEPBE/SDD
title: #p freq=noraman PBEPBE/SDD
converged: YES YES NO NO
title: Mulliken charges:
elementType: O C C C C C C H H H H H H H H H H H H
charge: -0.213038 -0.341699 -0.472454 -0.343661 0.216473 -0.692086 -0.765419 0.211752 0.211190 0.224721 0.224206 0.189753 0.189624 0.212322 0.214597 0.212365 0.232545 0.233040 0.255771
chargesum: 0.00000
title: Mulliken charges with hydrogens summed into heavy atoms:
elementType: O C C C C C C
charge: -0.213038 0.081243 -0.023527 0.035715 0.216473 -0.052803 -0.044063
polarizability: 8.00754831e+01 1.85755169e+00 6.76641953e+01 -3.75746011e-02 -8.02746698e-03 5.34884728e+01
1716.lowfreq: -64.7444 -8.6678 -0.0005 0.0007 0.0010 11.4278 25.8868 66.8072 73.6635
frequency: -64.1599 65.4229 73.5865 118.5618 124.2645 224.0900 286.3790 306.3065 445.3955 458.7508 572.5283 714.3753 766.0266 816.5933 881.2453 888.9683 944.4236 975.5255 1034.5552 1082.8606 1110.7500 1121.4009 1171.4265 1205.3989 1263.0534 1275.0306 1287.1726 1331.9273 1358.2939 1365.8504 1391.1264 1429.8788 1443.4309 1454.4970 1466.6459 1475.4829 1476.0416 1488.0289 1636.4314 2954.0095 2962.3730 2975.2610 2980.8725 2995.6435 2995.6896 3006.1830 3055.3741 3064.0497 3073.1278 3074.0823 3121.8135
redmass: 1.1470 1.8235 2.4301 3.5128 1.7958 1.1178 3.2259 3.6966 2.6364 2.0099 4.2352 1.1208 1.2141 3.8516 1.2285 1.7991 1.8653 1.2330 3.0052 2.2073 2.3662 1.7722 2.1514 1.4706 1.5105 1.1814 1.0586 1.6197 1.7177 1.2500 1.2174 1.0813 1.0827 1.0501 1.0710 1.0623 1.0420 1.0821 7.5311 1.0600 1.0591 1.0361 1.0375 1.0879 1.0683 1.1007 1.1027 1.0965 1.1008 1.0994 1.0998
irintensity: 0.3910 0.7510 0.3960 4.1178 0.2170 0.0236 2.9765 0.9327 3.6493 0.3217 6.8943 9.8883 1.0392 0.1813 0.1296 11.2514 2.8219 6.3948 1.5532 0.9308 2.5145 0.3640 54.1247 0.1465 43.5027 0.1164 0.1613 31.9002 8.0176 62.1181 13.0628 11.6630 34.8506 21.9206 1.0028 3.2210 12.2934 18.7383 102.7299 12.4822 41.3026 31.3093 7.2564 16.2566 27.2459 7.0642 15.0585 16.2303 99.6234 50.7051 15.3268
temp: 298.150 k
press: 1.00000 atm
elementType: 8 6 6 6 6 6 6 1 1 1 1 1 1 1 1 1 1 1 1
symmnumber: 1
zpe: 435382.1 jmol-1
zpe.correction: 0.165828 hartree
zpe.thermalcorrener: 0.174439 hartree
zpe.thermalcorrenthalpy: 0.175383 hartree
zpe.thermalcorrgfe: 0.132039 hartree
zpe.sumelectzpe: -310.476470 hartree
zpe.sumelectthermal: -310.467860 hartree
zpe.sumelectthermalent: -310.466915 hartree
zpe.sumelectthermalfe: -310.510259 hartree
dipole: 0.2133 -3.1206 0.0043
dipole: 3.1279
quadrupole: -43.4013 -48.7538 -43.1460
quadrupole: 5.7064 -0.0204 0.0047
quadrupole: 1.6991 -3.6534 1.9544 5.7064 -0.0204 0.0047
hfenergy: -310.6422985 hartree
pointgroup: C01 [X(C6H12O1)]
dipole: -0.113649 1.2253494 -0.0022714 debye
dipolederiv: -0.6304906 0.0227201 -0.0009009 0.0270933 -0.867783 0.0009717 -0.0008818 0.0011158 -0.2812754 -0.0082136 -0.0046596 -0.0000526 0.0147361 0.0435619 0.0008274 0.0005042 0.0001312 0.1543172 -0.3938857 0.1329983 -0.0024664 0.2696278 -0.119747 0.002903 -0.0055992 0.0042239 0.168018 0.0449008 -0.0088882 0.0001297 -0.0492467 0.1058076 0.0008751 0.0004222 0.0008687 0.1874804 1.1555984 0.0160331 0.0052692 -0.0305792 0.9918521 -0.0013431 0.0062055 -0.001693 0.0609023 -0.0666241 -0.0481573 0.0004819 -0.0230094 0.0484869 0.0003659 0.0001682 0.0003891 0.091354 -0.4392751 -0.2292762 -0.001903 -0.2312612 -0.1916791 -0.0019393 -0.0041786 -0.0030698 0.0391934 0.0495046 0.001227 -0.0029319 -0.0129859 -0.0157445 -0.1043627 0.0049869 -0.1115165 -0.0665496 0.0486277 0.0014885 0.0026439 -0.0128075 -0.0115802 0.1036445 -0.0051167 0.1108719 -0.0719014 0.0528102 0.0022725 0.020346 -0.0533414 0.0107555 0.0967991 0.0217427 0.1270157 -0.042372 0.0522908 0.0013265 -0.0206227 -0.0548318 0.0051318 -0.0983225 -0.0195738 -0.1289863 -0.0375723 0.0247569 -0.0250475 -0.0214067 0.0019562 -0.0530458 -0.1280412 0.0003458 -0.1529811 -0.0929289 0.0248335 -0.0246715 0.0219292 0.0017659 -0.0474933 0.1271983 -0.0002688 0.1520967 -0.0986102 0.0803983 0.0029796 -0.025728 -0.0431726 -0.012204 0.1195272 0.0198669 0.1362901 -0.089913 -0.1811464 0.091206 -0.0010921 0.1293204 0.0109194 0.0010494 -0.0015347 0.001019 0.1000818 0.0804182 0.0037643 0.0259158 -0.0433486 -0.0175954 -0.1210557 -0.0187245 -0.1377564 -0.0844055 0.093432 0.0057409 -0.046325 0.0003365 0.0425491 0.1022009 0.0062618 0.1200662 -0.027299 0.0932801 0.00453 0.0457273 -0.0002912 0.0463308 -0.1004532 -0.0059501 -0.117901 -0.0301271 -0.0812161 0.0544135 0.0009864 0.1100394 0.0314773 -0.000845 0.001324 -0.0001841 0.1216074 unknown
polarizability: 79.9781672|2.1562107|67.7614136|0.0334062|-0.0367915|53.4885705 unknown
InChI: InChI=1S/C6H12O/c1-3-4-5-6(2)7/h3-5H2,1-2H3
charge 0 multiplicity 1
19 atoms
O  1.712526 -1.369786 0.006434
C  -0.911763 -0.241195 0.008087
C  0.340167 0.655127 -0.002588
C  -2.224568 0.573763 0.000005
C  1.667618 -0.11084 0.004131
C  -3.479869 -0.325219 0.008812
C  2.940863 0.732594 0.007697
H  -0.883297 -0.918557 -0.866895
H  -0.882256 -0.899438 0.897574
H  0.335041 1.321647 -0.891964
H  0.336332 1.342911 0.87023
H  -2.246262 1.248112 0.881025
H  -2.246066 1.230486 -0.894262
H  -3.498403 -0.969222 0.90804
H  -4.408695 0.274171 0.001837
H  -3.497183 -0.988118 -0.8766
H  2.967213 1.398635 -0.875723
H  2.970444 1.384217 0.90178
H  3.828758 0.081809 0.001379
