program: Gaussian 09
title: 000138365
version: EM64L-G09RevD.01
frameworkgroup: C1[X(C12H19NO3)]
method: RPBEPBE
basis: SDD
operation: Freq
keyword: #p
keyword: freq=noraman
keyword: PBEPBE/SDD
title: #p freq=noraman PBEPBE/SDD
converged: NO NO NO NO
title: Mulliken charges:
elementType: O O O N C C C C C C C C C C C C H H H H H H H H H H H H H H H H H H H
charge: -0.292261 -0.305361 -0.313273 -0.290733 -0.562913 0.589890 -0.371522 -0.587180 -0.580162 0.256822 0.277062 0.013109 -0.626317 -0.526633 -0.527914 -0.525210 0.231986 0.197811 0.221952 0.197925 0.261664 0.257604 0.251854 0.190472 0.222982 0.226141 0.212307 0.262431 0.226850 0.254386 0.219219 0.227615 0.251590 0.233009 0.224799
chargesum: 0.00000
title: Mulliken charges with hydrogens summed into heavy atoms:
elementType: O O O N C C C C C C C C C C C C
charge: -0.292261 -0.305361 -0.313273 -0.038879 -0.133116 0.589890 0.048355 -0.325517 -0.322558 0.256822 0.277062 0.013109 0.013278 0.174956 0.173305 0.184186
polarizability: 1.98401864e+02 3.70538668e-01 1.55427376e+02 -9.55637331e+00 -7.04999562e-01 1.04910509e+02
1716.lowfreq: -6.6686 -3.2458 -0.0007 -0.0005 0.0005 12.4460 30.7653 43.4858 61.3218
frequency: 29.5845 43.4310 61.2071 79.1299 83.3317 87.2412 95.7087 113.1381 143.2250 152.3387 162.4959 164.8291 203.7019 209.8175 231.8915 243.2193 267.4129 278.2281 299.3298 325.0726 361.9155 379.5801 438.0758 471.9871 515.7652 571.9445 590.3463 639.8219 644.3974 679.5553 733.6272 764.2768 803.8022 867.3357 879.9545 892.0050 902.6296 943.0723 963.7615 1005.1417 1011.1420 1031.3780 1049.9173 1106.6601 1111.2376 1111.9037 1112.3441 1116.0525 1124.6086 1151.4512 1156.4783 1158.5020 1159.9391 1182.8661 1207.4867 1216.5131 1275.3813 1287.2767 1311.1512 1358.9275 1363.4055 1397.8512 1419.0377 1435.7781 1436.2584 1439.4556 1449.3913 1454.8110 1457.1922 1459.7130 1464.9194 1467.0439 1475.0487 1476.6388 1485.1353 1487.5714 1488.9978 1497.3153 1571.6596 1608.5113 2857.6867 2875.7946 2969.8680 2970.8179 2974.4793 2982.8536 3007.6547 3015.2026 3058.5433 3068.6731 3073.5055 3075.8696 3077.5909 3117.1206 3120.0506 3123.9689 3147.9488 3152.4315 3435.3484
redmass: 3.5523 3.5743 2.9091 3.2209 1.7226 2.5113 3.0882 2.5747 1.8544 1.2325 1.0923 1.4772 2.5685 2.7715 2.0980 2.0695 3.6697 4.7111 3.5493 4.5925 4.4482 4.4194 4.3547 4.9386 5.0234 5.3015 4.9672 2.9067 4.0797 1.6309 3.9700 4.0638 1.1734 5.3187 1.6759 1.5089 6.6759 9.2631 2.1223 3.3424 2.6212 3.6730 2.3871 1.2813 1.3184 2.4419 1.2614 1.2739 1.8381 1.3557 1.4279 2.3156 1.6434 1.9341 1.4609 1.5228 1.1816 1.5139 4.0360 3.9021 1.6364 1.9561 1.2602 1.2435 1.1471 1.5646 1.2143 1.2852 1.0624 1.0677 1.8688 1.0724 1.0919 1.0584 1.0540 1.0568 1.0659 1.0679 7.4597 7.0899 1.0703 1.0567 1.0326 1.0335 1.0298 1.0647 1.0848 1.0753 1.1003 1.1025 1.1054 1.0998 1.0980 1.1029 1.1030 1.1042 1.0914 1.0925 1.0743
irintensity: 0.2452 2.0424 2.8639 0.1192 4.1689 2.1008 11.3328 2.6603 0.8783 0.8449 0.0453 2.4226 5.1518 3.7152 8.7757 3.3984 7.0223 0.5940 8.3006 1.7977 0.7138 12.2262 1.3621 1.8410 1.3953 15.7040 3.8946 52.8775 20.4114 56.5523 9.1119 7.6739 0.1162 7.3701 46.4771 4.4470 30.9414 58.9605 1.5615 48.6450 62.6353 52.3560 90.4391 5.4407 13.8303 14.8641 6.9160 3.1878 46.8993 1.4052 6.3157 33.3551 14.2044 38.2739 11.0012 9.6209 12.5047 32.4996 85.0939 10.3817 4.1110 49.4375 3.0014 22.2103 3.2672 18.4499 36.3970 35.6696 16.6280 1.1582 33.2030 8.5339 3.3136 2.9281 17.1299 28.0630 13.0368 7.3529 82.7045 49.9736 76.3317 170.3481 56.5031 122.4964 50.3350 24.2361 35.5518 48.6812 25.7106 27.4855 21.6181 43.0526 31.9416 26.6898 24.1986 17.4291 5.8195 2.4685 1.5829
temp: 298.150 k
press: 1.00000 atm
elementType: 8 8 8 7 6 6 6 6 6 6 6 6 6 6 6 6 1 1 1 1 1 1 1 1 1 1 1 1 1 1 1 1 1 1 1
symmnumber: 1
zpe: 765644.1 jmol-1
zpe.correction: 0.291618 hartree
zpe.thermalcorrener: 0.310406 hartree
zpe.thermalcorrenthalpy: 0.311350 hartree
zpe.thermalcorrgfe: 0.243697 hartree
zpe.sumelectzpe: -747.771119 hartree
zpe.sumelectthermal: -747.752331 hartree
zpe.sumelectthermalent: -747.751387 hartree
zpe.sumelectthermalfe: -747.819040 hartree
dipole: -0.5767 0.4284 1.8764
dipole: 2.0092
quadrupole: -82.7114 -96.0811 -95.1809
quadrupole: 6.8434 0.0903 -1.6225
quadrupole: 8.6130 -4.7566 -3.8564 6.8434 0.0903 -1.6225
hfenergy: -748.0627375 hartree
pointgroup: C01[X(C12H19N1O3)]
dipole: 0.1968736 -0.1593122 0.7488161 debye
polarizability: 197.5279962|0.1994751|155.4319851|13.1383009|-0.1023108|105.7797676 unknown
InChI: InChI=1S/C12H19NO3/c1-13-6-5-9-7-10(14-2)12(16-4)11(8-9)15-3/h7-8,13H,5-6H2,1-4H3
charge 0 multiplicity 1
35 atoms
O  1.524702 -2.592928 0.083316
O  1.595489 2.363039 -0.000284
O  2.994699 -0.125449 0.468097
N  -4.94059 0.027015 -0.292687
C  -2.587307 -0.085353 -1.093952
C  -1.119773 -0.094866 -0.695768
C  -3.527997 -0.029267 0.137323
C  -0.419219 1.122292 -0.50902
C  -0.447155 -1.314369 -0.443888
C  0.907121 -1.331351 -0.039487
C  0.928111 1.11842 -0.093986
C  1.615747 -0.108841 0.119566
C  -5.911568 0.156699 0.81189
C  2.23003 -2.865094 1.354522
C  2.155202 2.686031 1.331333
C  3.876773 0.243675 -0.66633
H  -2.819484 0.786562 -1.731848
H  -2.825444 -0.99518 -1.680867
H  -3.310723 0.887318 0.720097
H  -3.304227 -0.896073 0.80991
H  -0.904679 2.088077 -0.68437
H  -0.953693 -2.276664 -0.574012
H  -5.171598 -0.759526 -0.915851
H  -5.864437 -0.663766 1.569814
H  -6.936845 0.191521 0.40289
H  -5.732715 1.109194 1.344545
H  1.507542 -2.877121 2.194091
H  3.014706 -2.112816 1.538774
H  2.671658 -3.865691 1.229323
H  2.863941 1.907319 1.663415
H  1.337858 2.791661 2.070571
H  2.669843 3.650764 1.20407
H  3.648176 1.268291 -1.011911
H  3.750294 -0.476153 -1.495975
H  4.904162 0.192132 -0.273711
