program: Gaussian 09
title: 000138364
version: EM64L-G09RevD.01
frameworkgroup: C1[X(C8H8N2)]
method: RPBEPBE
basis: SDD
operation: Freq
keyword: #p
keyword: freq=noraman
keyword: PBEPBE/SDD
title: #p freq=noraman PBEPBE/SDD
converged: NO YES YES YES
title: Mulliken charges:
elementType: N N C C C C C C C C H H H H H H H H
charge: -0.071795 -0.085283 0.275762 0.018170 -0.340765 -0.374924 -0.312851 -0.590926 -0.235810 -0.211389 0.270623 0.235346 0.244892 0.221338 0.256631 0.256637 0.221278 0.223065
chargesum: 0.00000
title: Mulliken charges with hydrogens summed into heavy atoms:
elementType: N N C C C C C C C C
charge: -0.071795 -0.085283 0.275762 0.018170 -0.070142 -0.139578 -0.067959 0.143680 -0.014532 0.011676
polarizability: 1.47037359e+02 1.78032214e+00 1.01450133e+02 3.31131505e-03 -1.44510495e-03 4.47594952e+01
1716.lowfreq: -13.8944 -8.9668 -0.0006 -0.0006 0.0007 2.5671 14.8240 134.4444 251.2626
frequency: 13.9155 134.4443 251.2625 265.3919 283.4864 432.7650 466.9128 488.9587 570.5128 604.6300 609.2750 666.3420 725.7440 763.7420 783.5903 817.9016 860.0485 889.4379 949.2653 959.9278 981.2671 999.1799 1049.1243 1122.9478 1123.8208 1148.7357 1161.4958 1238.8435 1276.3014 1302.9216 1346.1358 1396.5769 1399.2744 1443.8931 1455.9417 1475.3484 1493.3295 1509.7092 1556.9947 1637.3453 3010.0660 3104.3014 3126.1597 3126.2197 3137.5610 3155.1354 3168.8125 3234.1402
redmass: 1.0778 3.2059 4.1416 3.1028 4.0408 2.8407 3.6409 6.0040 3.3380 6.6318 4.4694 5.2871 1.3461 1.8069 2.0221 4.1295 1.5994 5.6241 1.3580 6.4134 1.3032 2.2819 1.6704 1.5282 1.3354 1.6708 1.1295 2.1471 2.5662 2.8698 2.7527 2.5818 2.4976 1.3996 1.0411 2.7162 1.4905 3.2636 6.2313 7.4503 1.0332 1.1021 1.0895 1.0976 1.0896 1.0960 1.0995 1.0991
irintensity: 0.4572 7.5916 3.1289 6.2439 0.1704 11.7919 3.2502 0.6741 0.7232 0.3224 7.6840 0.3519 0.0147 78.9888 59.9988 5.6301 0.3707 3.0910 2.1514 5.9055 0.0186 5.8478 6.3272 2.9215 2.4133 32.5234 1.3194 4.9755 13.2937 2.6124 4.6831 27.9200 3.4992 8.4675 15.7625 4.1485 5.6459 12.8353 1.2075 7.1321 45.8115 14.1209 4.5636 6.4522 11.4778 30.7875 24.3695 0.3677
temp: 298.150 k
press: 1.00000 atm
elementType: 7 7 6 6 6 6 6 6 6 6 1 1 1 1 1 1 1 1
symmnumber: 1
zpe: 375143.7 jmol-1
zpe.correction: 0.142885 hartree
zpe.thermalcorrener: 0.150913 hartree
zpe.thermalcorrenthalpy: 0.151858 hartree
zpe.thermalcorrgfe: 0.108660 hartree
zpe.sumelectzpe: -418.428640 hartree
zpe.sumelectthermal: -418.420611 hartree
zpe.sumelectthermalent: -418.419667 hartree
zpe.sumelectthermalfe: -418.462864 hartree
dipole: 1.9089 2.1119 0.0000
dipole: 2.8468
quadrupole: -43.4271 -55.4110 -62.6737
quadrupole: 4.1283 0.0004 -0.0001
quadrupole: 10.4102 -1.5738 -8.8364 4.1283 0.0004 -0.0001
hfenergy: -418.5715243 hartree
pointgroup: C01 [X(C8H8N2)]
dipole: 0.7502479 -0.8315979 0.0000015 debye
dipolederiv: -0.670937 -0.0666265 0.0000333 -0.0885588 0.3454851 0.0000017 -0.0000995 -0.000011 -0.0712783 -0.3113534 0.1130474 -0.0000018 -0.2503959 -0.3695478 0.000002 0.0000164 0.000013 -0.1944119 -0.1551585 0.0564557 0.0000032 -0.0890617 -0.1894512 0.000005 0.0000145 0.0000035 0.0312812 0.1552808 -0.0592516 0.0000002 0.1017339 -0.0493296 0.0000038 0.0000053 0.0000028 0.0010768 0.2781991 -0.1160522 -0.000008 0.2576633 -0.1118789 -0.0000088 0.0000138 -0.0000146 -0.2041262 0.2150788 -0.0197269 -0.0000121 0.0709752 0.097518 -0.0000089 -0.0000167 -0.0000013 -0.1717794 0.0728303 -0.0300889 -0.0000075 -0.0504058 0.0905825 -0.0000053 -0.0000079 -0.0000071 -0.160444 0.5544321 0.0528856 -0.0000395 -0.0010054 0.1670655 -0.0000173 0.0000363 -0.0000127 0.173482 -0.0791703 0.1274787 -0.0000051 0.1965675 -0.0036723 -0.0000121 -0.0000078 -0.0000104 -0.1850696 -0.0533295 -0.0919643 0.000001 -0.1714891 0.0880129 -0.0000012 0.0000038 -0.0000048 -0.1717617 0.04773 0.0537138 -0.0000002 0.0567657 0.0183987 0.0000036 -0.0000038 0.0000107 0.2253863 0.0679295 0.0076025 0.0000028 -0.0457555 -0.1104817 0.0000088 0.0000037 0.0000058 0.1682764 0.0841842 -0.0238195 0.0000028 0.0280969 -0.0817239 0.0000061 0.0000013 0.0000069 0.1674122 0.023182 0.0005856 -0.0000016 0.1138111 -0.0852221 0.000054 -0.0000205 0.0000461 0.1262498 -0.018422 -0.008398 0.0185138 -0.0689914 0.0651522 0.0900013 0.0977603 0.0773317 -0.0301567 -0.0183537 -0.0083967 -0.0184947 -0.0690374 0.0650895 -0.0900397 -0.0977121 -0.0773666 -0.0300544 -0.1047004 -0.0954111 0.0000099 -0.0909432 0.0395278 0.0000061 0.0000101 0.0000058 0.1651272 -0.0874218 0.1079665 0.0000034 0.1000304 0.0244754 0.0000011 0.0000027 0.0000021 0.1607903 unknown
polarizability: 147.0339944|-1.8228821|101.4534972|-0.0033127|-0.001442|44.7594952 unknown
InChI: InChI=1S/C8H8N2/c1-10-6-7-4-2-3-5-8(7)9-10/h2-6H,1H3
charge 0 multiplicity 1
18 atoms
N  1.973026 -0.054458 -0.000083
N  1.226461 1.116718 -0.000112
C  -0.138265 -0.797661 -0.000024
C  -0.081062 0.656963 -0.000067
C  1.217391 -1.210227 -0.000058
C  -1.399727 -1.467893 0.000033
C  -1.277537 1.433275 -0.000053
C  3.433991 0.056752 -0.000142
C  -2.560777 -0.688121 0.000042
C  -2.498347 0.750719 0.000001
H  1.67285 -2.197259 -0.000038
H  -1.456077 -2.562011 0.000062
H  -1.227629 2.526575 -0.000085
H  3.878445 -0.950459 0.000096
H  3.766344 0.606477 -0.895995
H  3.766365 0.606911 0.895434
H  -3.54285 -1.174101 0.000081
H  -3.435301 1.319202 0.000008
