program: Gaussian 09
title: 000138363
version: EM64L-G09RevD.01
frameworkgroup: C1[X(C9H9NO)]
method: RPBEPBE
basis: SDD
operation: Freq
keyword: #pfreq=noraman
keyword: PBEPBE/SDD
title: #p freq=noraman PBEPBE/SDD
converged: YES YES NO NO
title: Mulliken charges:
elementType: O N C C C C C C C C C H H H H H H H H H
charge: -0.295655 -0.411101 0.148555 0.245861 0.208256 -0.357721 -0.378938 -0.243746 -0.395550 -0.180304 -0.520739 0.251123 0.306049 0.228009 0.254307 0.244465 0.221324 0.223296 0.221003 0.231505
chargesum: 0.00000
title: Mulliken charges with hydrogens summed into heavy atoms:
elementType: O N C C C C C C C C C
charge: -0.295655 -0.105052 0.148555 0.245861 0.208256 -0.106599 -0.150929 0.010562 -0.151085 0.041021 0.155065
polarizability: 1.29504357e+02 5.29976932e+00 1.32505817e+02 -3.73706892e+00 2.78008728e+00 5.01718216e+01
1716.lowfreq: -13.8005 -7.6299 0.0005 0.0006 0.0006 6.8081 70.3991 125.7245 138.4973
frequency: 70.3673 125.7226 138.4710 206.4892 237.2891 270.0927 334.4466 454.6134 491.1557 517.6901 544.4153 585.1106 601.0130 628.3840 648.6483 722.9646 751.1470 793.0489 821.3954 854.3715 877.3231 889.2657 925.0882 951.0101 1015.9922 1051.7010 1076.1101 1109.5268 1122.1274 1152.4584 1171.5754 1208.1356 1219.3485 1273.2544 1339.2036 1368.3709 1417.2742 1433.7494 1443.8044 1459.5930 1474.7010 1491.2419 1509.8089 1583.2680 1625.1530 2964.3114 3053.9089 3115.5768 3131.3951 3150.8665 3169.6666 3216.1947 3241.4590 3613.6549
redmass: 2.6150 1.8010 1.6220 4.0332 4.5261 4.3638 3.8851 5.0050 5.7169 1.3552 2.9389 5.8781 3.0469 4.5929 5.6406 1.4535 1.3387 3.0758 5.0510 1.3311 1.4129 4.6708 5.9487 1.3153 2.7427 1.8802 1.9059 1.2645 1.3400 1.2837 1.3424 2.3772 1.9653 2.1651 2.0746 4.8732 2.2844 1.2390 6.1658 1.0575 1.0730 2.7363 4.5801 6.2109 7.7722 1.0322 1.1022 1.1013 1.0861 1.0935 1.0973 1.0905 1.1066 1.0810
irintensity: 8.0292 2.3229 1.6350 10.0796 1.9289 1.7568 9.8263 6.9991 1.1714 83.0135 5.3358 3.5343 6.7813 0.7320 2.3314 7.1572 167.1873 9.9216 7.4852 2.8740 0.5668 8.6210 16.9569 3.4100 64.4265 20.1201 51.3860 2.6984 0.7384 3.7678 5.2692 19.1096 77.6656 1.5466 42.7964 45.5455 12.5844 1.3882 7.6333 10.8769 21.4947 50.5458 5.6646 39.3178 14.9862 77.4708 41.3839 31.2298 3.1852 22.0099 14.6604 0.7420 3.7638 58.1856
temp: 298.150 k
press: 1.00000 atm
elementType: 8 7 6 6 6 6 6 6 6 6 6 1 1 1 1 1 1 1 1 1
symmnumber: 1
zpe: 416557.4 jmol-1
zpe.correction: 0.158658 hartree
zpe.thermalcorrener: 0.167940 hartree
zpe.thermalcorrenthalpy: 0.168885 hartree
zpe.thermalcorrgfe: 0.124131 hartree
zpe.sumelectzpe: -477.532640 hartree
zpe.sumelectthermal: -477.523358 hartree
zpe.sumelectthermalent: -477.522414 hartree
zpe.sumelectthermalfe: -477.567167 hartree
dipole: -2.5451 -1.1636 1.6814
dipole: 3.2648
quadrupole: -49.9633 -56.5480 -70.0357
quadrupole: -0.9467 2.5069 -0.0846
quadrupole: 8.8857 2.3010 -11.1867 -0.9467 2.5069 -0.0846
hfenergy: -477.6912984 hartree
pointgroup: C01 [X(C9H9N1O1)]
dipole: 1.0565191 -0.2405204 -0.6897418 debye
dipolederiv: -0.9307079 -0.4292196 -0.1414329 -0.6518436 -0.8537338 -0.122394 0.0196049 -0.0000991 -0.3785887 -0.5785986 0.1220045 0.0277929 -0.2499921 -0.403808 0.0252433 0.065327 -0.0053128 -0.2886048 -0.355454 -0.118038 0.0157745 -0.2553677 0.0947676 -0.0034195 0.0901762 0.0235268 -0.0215739 0.4359439 -0.3174849 -0.0333336 -0.0883014 0.0283577 0.0217481 -0.0446465 0.0464606 0.0420878 0.9565826 0.4011019 0.0644748 0.5071331 0.671087 -0.015805 -0.1593102 -0.1264727 -0.013849 -0.2319009 -0.0356419 -0.0164924 0.0809064 -0.0408213 -0.0205875 -0.0329514 -0.0254025 -0.2516125 -0.101309 -0.0114184 -0.0278368 0.0492057 0.0103251 -0.0221397 -0.0210252 -0.0022884 -0.2120529 0.2142176 0.2641241 -0.0542807 0.4642021 0.1941602 -0.0669983 -0.0754445 -0.0523246 -0.1606358 -0.0863066 -0.0502279 -0.0568473 -0.2117035 -0.3219798 -0.0046461 -0.0708249 -0.0234657 -0.184416 0.1124664 0.0999457 -0.0389415 0.0840856 0.0656616 -0.010701 -0.0445159 -0.0170969 -0.1620198 0.3398173 0.0736835 0.1185277 0.2828456 0.5028869 0.1306069 0.2821068 0.1902646 0.4453064 0.0733466 -0.0780112 0.0195182 -0.0417669 -0.0237033 0.0145947 0.027701 0.0247362 0.1872285 0.2227845 -0.008085 0.0138606 -0.0130058 0.1490223 0.0110654 0.0089752 0.008002 0.3456159 -0.04807 -0.1138491 0.0327829 -0.0739978 0.0074932 0.0135 0.0349926 0.0167506 0.1789519 0.0142556 0.0837154 0.0163321 0.0685535 0.0357626 0.0043315 0.0163766 -0.0000719 0.2107624 -0.0677277 0.064742 0.0303595 0.0613648 0.0760371 -0.0016135 0.025441 -0.0040726 0.1660702 0.0815162 0.0345837 0.0082208 0.0244339 -0.1386405 -0.0023792 0.0173295 0.0022153 0.159559 -0.0248177 0.1525206 0.0530065 0.0672177 -0.0363112 -0.0692315 -0.0174869 -0.0700533 0.020488 0.0500026 0.0055612 -0.0643362 0.0364494 -0.0197571 0.1087003 -0.1768469 -0.0157134 -0.1412015 -0.0760407 -0.1400066 0.0328509 -0.1404191 0.0031937 0.0101253 0.0550217 0.0304176 0.0584849 unknown
polarizability: 131.2730876|-5.2757454|130.7563485|-4.4971395|1.5337838|50.1525593 unknown
InChI: InChI=1S/C9H9NO/c1-11-9-4-2-3-8-7(9)5-6-10-8/h2-6,10H,1H3
charge 0 multiplicity 1
20 atoms
O  -2.339489 -0.64493 0.418939
N  2.368472 -0.222113 -0.219006
C  0.106288 -0.369197 0.055351
C  1.202929 0.549148 -0.116433
C  -1.204038 0.173663 0.201918
C  0.664467 -1.706814 0.066231
C  1.037852 1.95371 -0.128656
C  2.041886 -1.580319 -0.102375
C  -1.38096 1.569097 0.202819
C  -0.27008 2.44752 0.043738
C  -2.677092 -1.569007 -0.678508
H  0.129057 -2.641733 0.21651
H  3.30747 0.150867 -0.337397
H  1.886497 2.634112 -0.256785
H  2.811513 -2.349004 -0.141101
H  -2.392879 1.965731 0.33085
H  -0.442713 3.529373 0.049033
H  -1.828188 -2.225761 -0.944075
H  -2.991771 -1.00297 -1.577081
H  -3.517021 -2.175474 -0.306071
