program: Gaussian 09
title: 000138362
version: EM64L-G09RevD.01
frameworkgroup: C1[X(C8H16O3)]
method: RPBEPBE
basis: SDD
operation: Freq
keyword: #pfreq=noraman
keyword: PBEPBE/SDD
title: #p freq=noraman PBEPBE/SDD
converged: YES YES NO NO
title: Mulliken charges:
elementType: O O O C C C C C C C C H H H H H H H H H H H H H H H H
charge: -0.247032 -0.295420 -0.279174 -0.424039 -0.407448 0.003021 -0.384479 -0.308218 -0.238783 -0.281649 -0.493071 0.203499 0.216853 0.215048 0.220863 0.212946 0.199802 0.207310 0.200546 0.215814 0.228544 0.201640 0.197457 0.198816 0.234022 0.201555 0.201576
chargesum: 0.00000
title: Mulliken charges with hydrogens summed into heavy atoms:
elementType: O O O C C C C C C C C
charge: -0.247032 -0.295420 -0.279174 -0.003687 0.028463 0.215967 0.022633 0.108143 0.191401 0.114624 0.144082
polarizability: 1.16110313e+02 -1.16936071e-01 8.73154107e+01 1.19715616e+00 1.83978918e+00 8.26331944e+01
1716.lowfreq: -12.6139 -2.3052 0.0004 0.0009 0.0010 20.7822 26.0330 46.4695 75.0925
frequency: 24.1590 45.6519 74.7632 87.6202 114.8064 152.9643 195.9165 220.8431 248.1181 264.3426 332.2438 393.2208 420.7631 436.9863 505.5088 544.2383 666.1381 768.8114 792.7821 828.8038 847.2679 862.3432 877.1370 904.8242 938.8423 988.4038 1007.6491 1029.0465 1054.5026 1065.3330 1098.9793 1100.8352 1111.9133 1120.4954 1126.3695 1162.7655 1169.6329 1174.7411 1183.0439 1251.5170 1254.2718 1270.4376 1296.1381 1324.7750 1338.9925 1341.7405 1349.6435 1352.6440 1364.7893 1398.5157 1439.4684 1443.8478 1453.4799 1457.3832 1459.6717 1469.7713 1474.5482 1487.0216 1497.3062 2922.9559 2937.8290 2968.9103 2978.0551 2982.8266 2987.4381 2988.8281 2995.2729 2997.2586 3007.3708 3042.4250 3050.3676 3056.3351 3071.1399 3082.5865 3103.3427
redmass: 2.5035 2.4907 3.5195 2.9261 2.5927 2.9513 2.9246 1.2604 4.1483 2.5097 1.9327 3.3187 3.5593 3.5171 2.1885 3.7570 3.2286 4.1846 1.9114 1.1101 2.7410 2.4352 2.6717 3.1278 1.7982 4.9754 2.4803 2.9045 1.9951 4.8518 2.3850 1.4690 2.1151 1.7032 1.6408 1.4959 1.1693 1.3096 1.4824 1.1648 1.2240 1.2154 1.2420 1.2907 1.2497 1.4012 1.4877 1.4219 1.2744 1.4488 1.1677 1.0930 1.0884 1.0515 1.0848 1.0627 1.0910 1.0735 1.0818 1.0364 1.0528 1.0635 1.0660 1.0596 1.0880 1.0924 1.0610 1.1029 1.0698 1.1004 1.1047 1.1011 1.1025 1.1006 1.0971
irintensity: 2.3463 1.3907 0.4385 1.6135 5.3314 7.6938 7.0511 6.6235 3.0818 7.6878 1.4101 6.4481 4.4886 3.8027 3.3026 3.6212 0.5404 24.1537 23.0279 1.0629 22.1838 15.9127 41.5472 28.0231 42.7058 139.3653 30.3086 37.0822 22.0718 153.7645 23.5094 3.2448 41.4139 4.8599 3.5395 8.0643 9.1036 6.0642 20.0813 0.2826 7.4884 7.3402 19.3908 3.8040 1.5881 0.3250 7.9522 0.5010 0.7274 7.9574 0.3183 7.2448 12.6064 12.1043 6.2242 14.5564 10.2443 0.2877 7.9563 73.1058 64.7607 38.3363 41.2905 37.3184 9.7621 79.0291 43.7076 62.0974 63.0043 30.3490 48.7683 58.7820 41.5755 46.0893 32.9806
temp: 298.150 k
press: 1.00000 atm
elementType: 8 8 8 6 6 6 6 6 6 6 6 1 1 1 1 1 1 1 1 1 1 1 1 1 1 1 1
symmnumber: 1
zpe: 615130.0 jmol-1
zpe.correction: 0.234291 hartree
zpe.thermalcorrener: 0.246650 hartree
zpe.thermalcorrenthalpy: 0.247594 hartree
zpe.thermalcorrgfe: 0.194108 hartree
zpe.sumelectzpe: -539.161624 hartree
zpe.sumelectthermal: -539.149264 hartree
zpe.sumelectthermalent: -539.148320 hartree
zpe.sumelectthermalfe: -539.201807 hartree
dipole: 0.1266 -0.8413 1.9695
dipole: 2.1454
quadrupole: -58.6231 -66.9171 -68.5730
quadrupole: 1.3118 -2.9230 4.1166
quadrupole: 6.0813 -2.2127 -3.8686 1.3118 -2.9230 4.1166
hfenergy: -539.3959145 hartree
pointgroup: C01[X(C8H16O3)]
dipole: -0.0615825 -0.2894123 -0.7905122 debye
polarizability: 116.1103486|-0.6276199|87.5053467|0.9531109|-1.6133103|82.4432232 unknown
InChI: InChI=1S/C8H16O3/c1-9-6-7-11-8-4-2-3-5-10-8/h8H,2-7H2,1H3
charge 0 multiplicity 1
27 atoms
O  -1.447922 0.839409 1.141252
O  0.097681 -0.627845 -0.013576
O  3.659636 0.234134 0.22575
C  -2.202155 -1.326853 0.155272
C  -2.708207 -0.580773 -1.101959
C  -1.076835 -0.548449 0.853252
C  -3.096117 0.871874 -0.736259
C  -1.906499 1.577043 -0.062861
C  1.317506 -0.082393 0.609458
C  2.445393 -0.301385 -0.396447
C  4.831765 0.079192 -0.630813
H  -3.030477 -1.443724 0.879986
H  -1.82861 -2.334267 -0.101327
H  -3.571489 -1.116342 -1.538316
H  -1.906108 -0.568233 -1.864319
H  -0.836611 -0.956702 1.855756
H  -3.395397 1.43941 -1.638856
H  -3.95891 0.867452 -0.041756
H  -1.061034 1.669396 -0.774922
H  -2.173313 2.576614 0.3174
H  1.194039 0.993555 0.833199
H  1.536648 -0.617517 1.556729
H  2.220859 0.229383 -1.347311
H  2.560038 -1.38457 -0.618278
H  5.68173 0.502928 -0.073151
H  4.711435 0.626884 -1.590336
H  5.034953 -0.990223 -0.854968
