program: Gaussian 09
title: 000138360
version: EM64L-G09RevD.01
frameworkgroup: C1[X(C6H16N2)]
method: RPBEPBE
basis: SDD
operation: Freq
keyword: #pfreq=noraman
keyword: PBEPBE/SDD
title: #p freq=noraman PBEPBE/SDD
converged: YES YES NO NO
title: Mulliken charges:
elementType: N N C C C C C C H H H H H H H H H H H H H H H H
charge: -0.308169 -0.580512 -0.026154 -0.376644 -0.332811 -0.712731 -0.689188 -0.391625 0.191448 0.184145 0.192029 0.231053 0.205514 0.191316 0.226657 0.200702 0.212351 0.205051 0.192695 0.200496 0.242905 0.205928 0.260402 0.275142
chargesum: 0.00000
title: Mulliken charges with hydrogens summed into heavy atoms:
elementType: N N C C C C C C
charge: -0.077116 -0.044967 0.165293 -0.000470 0.064019 -0.073021 -0.039859 0.006121
polarizability: 9.58010501e+01 -8.94403152e-03 7.65973720e+01 1.96363723e-01 -1.33230933e+00 7.03988722e+01
1716.lowfreq: -9.5818 -7.6303 -0.0008 -0.0008 -0.0005 7.7604 53.9741 62.6459 100.6279
frequency: 53.6983 62.4199 100.6227 114.2784 161.3820 198.9811 213.1514 217.6074 247.3350 298.4110 361.4417 412.0827 464.4920 498.3893 599.1318 657.9000 775.0969 802.3967 824.3489 902.3940 951.0387 970.5004 986.2601 1027.8777 1057.1388 1085.6728 1103.2880 1112.4560 1123.8241 1174.2604 1203.5907 1244.7289 1259.9790 1282.7365 1287.4642 1312.4187 1336.1521 1353.1897 1374.2077 1380.4178 1388.3818 1441.8417 1461.7651 1470.1439 1472.3157 1477.8554 1480.8953 1490.7130 1492.0043 1641.4946 2902.7431 2917.0774 2954.7944 2964.6153 2970.2604 2976.0514 2985.8236 3016.2189 3018.2167 3059.8684 3067.1629 3071.4812 3088.6325 3411.0907 3463.6397 3590.9180
redmass: 2.7769 1.8472 2.9332 1.8586 2.1613 1.3892 1.1520 1.2058 1.5727 2.6465 2.7071 2.9767 2.0837 2.6309 1.3082 1.6001 1.2316 1.1487 1.6878 1.8672 1.4873 1.3122 1.5862 3.0403 2.2267 1.7895 2.4090 2.1182 2.6443 2.2423 1.8055 1.2892 1.3344 1.1400 1.2083 1.2643 1.5364 1.3056 1.2264 1.2306 1.4278 1.1692 1.0695 1.0458 1.0686 1.0761 1.0725 1.0578 1.0876 1.0936 1.0669 1.0663 1.0660 1.0422 1.0727 1.0371 1.0899 1.0969 1.0979 1.0991 1.0994 1.0991 1.0996 1.0734 1.0450 1.0976
irintensity: 0.4025 3.4293 0.5135 0.4201 8.6518 14.1935 10.0812 31.3151 1.8722 5.4252 3.2120 0.9831 7.4018 6.2672 252.1258 87.4592 12.6176 4.1534 2.1308 1.4440 6.4776 4.5123 13.8934 8.0489 4.5598 3.0447 22.7576 25.9718 38.6966 38.7388 0.2172 6.5226 0.2111 0.3095 3.4804 6.3064 5.3895 3.6347 21.0118 14.8749 7.0998 26.1747 4.5132 5.6322 1.2714 15.4689 2.0085 12.1377 6.1514 40.1058 3.8411 162.6146 10.3948 24.4482 63.8105 34.6569 8.2194 84.5274 31.0262 38.5750 78.1349 42.4547 38.7178 2.7020 0.9140 0.3197
temp: 298.150 k
press: 1.00000 atm
elementType: 7 7 6 6 6 6 6 6 1 1 1 1 1 1 1 1 1 1 1 1 1 1 1 1
symmnumber: 1
zpe: 573422.6 jmol-1
zpe.correction: 0.218405 hartree
zpe.thermalcorrener: 0.229662 hartree
zpe.thermalcorrenthalpy: 0.230606 hartree
zpe.thermalcorrgfe: 0.181498 hartree
zpe.sumelectzpe: -347.019671 hartree
zpe.sumelectthermal: -347.008414 hartree
zpe.sumelectthermalent: -347.007469 hartree
zpe.sumelectthermalfe: -347.056577 hartree
dipole: 0.3582 -0.2614 0.0239
dipole: 0.4441
quadrupole: -49.2177 -55.8782 -48.6074
quadrupole: -5.9100 -0.9071 -0.0344
quadrupole: 2.0167 -4.6437 2.6270 -5.9100 -0.9071 -0.0344
hfenergy: -347.2380757 hartree
pointgroup: C01 [X(C6H16N2)]
dipole: 0.1323459 0.113902 -0.0060814 debye
dipolederiv: -0.8543211 -0.0805213 -0.0050842 -0.0401709 -0.6749457 0.0704723 -0.0126931 0.0829374 -0.1169617 -0.7217723 0.0964537 -0.0853837 0.1523728 -0.6912168 -0.0498195 -0.0946053 -0.0360897 -0.2357783 0.543167 0.1396655 -0.0843226 0.1220462 0.4441822 -0.0013403 -0.2237817 -0.0666886 0.2271837 0.0258737 0.0224829 -0.0282228 0.0331635 0.0120256 -0.0047863 -0.0411247 -0.0072071 0.1607462 0.4762766 -0.0921126 0.0508038 -0.0919348 0.2576942 0.0653648 0.2579343 0.0701971 0.2282963 -0.0600511 0.0208678 0.0104942 -0.0671703 -0.250905 -0.0112933 0.0285448 -0.0133616 0.0903827 0.0072696 0.0492349 0.0136897 0.0049283 -0.0855501 -0.0268115 -0.0023052 -0.0215598 0.0838311 0.5527164 -0.1298954 0.0769201 -0.0317607 0.3168461 0.0685583 0.1257706 0.0153095 0.2554668 0.0182339 -0.0169347 -0.0390696 -0.0343369 0.008219 -0.0540471 0.0014511 -0.0289299 -0.1857121 0.0658149 0.0177377 0.0376543 0.0334061 0.0309942 -0.044883 -0.0223593 -0.0387448 -0.2061107 -0.1276297 -0.1100879 0.0402934 -0.1154304 -0.0520583 0.034155 0.0761962 0.043549 0.0535374 0.0896006 -0.0327397 -0.0118818 -0.0138506 0.2826863 -0.1090577 -0.0063397 -0.0130879 -0.0446044 -0.0882589 0.0808388 -0.0103637 0.1371524 -0.2170924 -0.0194382 -0.0179066 -0.043889 0.0373671 0.0346407 0.0101575 0.0453002 0.0078182 0.0592424 -0.0127757 -0.0157564 0.0014628 -0.1869578 -0.0885492 0.1488558 -0.0613698 0.1151669 0.0120152 0.0159631 -0.0635669 0.0268821 0.0607233 0.0865268 -0.0191196 -0.0277911 0.0007267 0.0590538 0.0095824 -0.0376449 -0.07404 -0.169457 -0.0897313 -0.1322603 0.1001884 -0.1173467 0.0041155 0.036804 0.107627 0.0632234 0.0253039 -0.0832809 0.1279827 -0.0195082 0.1105463 -0.22585 -0.0154626 0.0007322 -0.0522248 0.0394787 0.018854 0.0086163 0.0040608 0.0108191 0.0702414 -0.0237303 -0.0002808 0.0123367 -0.2005783 0.0916588 0.0036552 0.0101113 0.0012325 0.0578925 0.0121434 0.046834 -0.0486519 -0.1904682 0.0082019 -0.1625995 0.0385797 -0.1179677 0.0341954 0.018031 0.0433719 0.0332383 0.0685813 -0.1164037 0.1446558 -0.0819648 0.1231138 -0.0128748 0.0305823 -0.0998739 0.0498572 0.0474587 0.1571793 0.0015773 0.0169484 -0.0153512 0.321137 -0.093047 -0.0357411 -0.0330078 -0.0034951 0.0539838 -0.0965109 0.0099179 -0.2071725 0.2399523 0.104836 -0.0144826 0.0784893 0.1617665 unknown
polarizability: 95.6724497|1.5621428|76.750081|0.3307684|-1.2505725|70.3747635 unknown
InChI: InChI=1S/C6H16N2/c1-3-6(2)8-5-4-7/h6,8H,3-5,7H2,1-2H3
charge 0 multiplicity 1
24 atoms
N  0.005638 0.088904 -0.365201
N  3.720583 0.434017 0.265328
C  -1.168785 -0.601522 0.228597
C  -2.469096 0.082404 -0.266119
C  1.333357 -0.241148 0.194875
C  -1.205047 -2.131097 -0.045992
C  -2.605275 1.544996 0.203916
C  2.39444 0.76924 -0.291806
H  -1.098001 -0.446337 1.326086
H  -2.489359 0.039984 -1.376257
H  -3.336966 -0.512222 0.082481
H  -0.003187 0.009039 -1.39333
H  1.702077 -1.265531 -0.045381
H  1.254658 -0.180084 1.300165
H  -0.266842 -2.618899 0.275914
H  -1.340076 -2.327498 -1.127905
H  -2.041694 -2.61436 0.493304
H  2.029748 1.793987 -0.048176
H  2.466154 0.708144 -1.396224
H  -2.712136 1.597547 1.304258
H  -1.701353 2.113983 -0.074849
H  -3.488971 2.034897 -0.245356
H  3.783329 0.53657 1.282971
H  4.510504 0.875487 -0.212701
