program: Gaussian 09
title: 000138355
version: EM64L-G09RevD.01
frameworkgroup: C1[X(C10H4N4O8)]
method: RPBEPBE
basis: SDD
operation: Freq
keyword: #p
keyword: freq=noraman
keyword: PBEPBE/SDD
title: #p freq=noraman PBEPBE/SDD
converged: YES YES NO NO
title: Mulliken charges:
elementType: O O O O O O O O N N N N C C C C C C C C C C H H H H
charge: -0.176557 -0.176489 -0.176559 -0.176487 -0.155428 -0.155203 -0.155407 -0.155222 0.019961 0.019660 0.019965 0.019672 0.199095 0.199360 0.290675 0.290652 0.290675 0.290621 -0.379234 -0.378768 -0.379210 -0.378769 0.300824 0.300674 0.300816 0.300682
chargesum: 0.00000
title: Mulliken charges with hydrogens summed into heavy atoms:
elementType: O O O O O O O O N N N N C C C C C C C C C C
charge: -0.176557 -0.176489 -0.176559 -0.176487 -0.155428 -0.155203 -0.155407 -0.155222 0.019961 0.019660 0.019965 0.019672 0.199095 0.199360 0.290675 0.290652 0.290675 0.290621 -0.078410 -0.078093 -0.078394 -0.078087
polarizability: 2.41915087e+02 2.01610520e-03 2.20887276e+02 -5.88261019e-04 2.97492989e-02 8.78567150e+01
1716.lowfreq: -8.4039 -1.8103 -0.0010 -0.0009 -0.0007 5.0937 37.6236 69.5367 70.7161
frequency: 37.6236 69.5357 70.7161 79.2807 82.5724 91.2536 107.4529 159.7951 164.5451 188.2678 190.1720 220.2155 243.8405 245.8926 286.2049 294.8658 316.6719 324.7104 405.2156 430.0715 451.5233 461.0837 498.8183 526.7504 535.5153 577.1582 613.8186 625.4169 629.7884 652.0505 682.2337 703.7062 707.4558 707.4855 733.9528 737.6637 749.3618 764.7509 792.5250 861.3128 877.6776 877.7522 977.2565 979.3979 1002.2900 1041.4052 1122.8131 1141.3411 1172.3759 1186.9979 1198.3464 1201.8846 1207.4209 1215.0447 1216.0181 1319.2638 1366.3119 1375.0781 1385.5191 1386.2596 1388.6150 1408.5992 1412.2438 1435.7020 1508.0095 1571.8997 1587.7979 1619.6194 3179.0990 3179.3120 3192.7644 3192.8205
redmass: 14.8978 11.0995 8.0094 14.5062 15.9351 14.1992 15.7848 5.7692 12.8380 15.3018 15.7304 10.9572 7.7054 9.2715 13.0116 11.5858 11.0272 10.2421 8.0901 6.8370 3.2483 9.0944 12.3227 10.2592 5.7211 8.5748 5.3738 6.6678 9.1891 12.9043 12.4503 6.6040 5.0524 7.8897 13.1717 8.9167 12.1764 7.3800 8.2943 8.7382 1.4393 1.4261 1.5232 1.4191 4.2790 9.5763 2.5760 1.6555 3.4586 2.2663 5.4321 2.7634 3.7198 6.3270 10.5086 4.3820 2.1329 10.7490 14.5727 14.1504 11.5925 11.9868 5.7394 2.6494 5.3748 8.2333 6.6578 9.3072 1.0901 1.0901 1.0969 1.0968
irintensity: 0.0000 9.9246 0.0228 1.7281 0.0018 2.3150 0.0000 4.4411 12.3743 0.4386 0.0000 11.0186 0.0578 0.0000 0.9834 0.0001 0.0110 0.3918 0.0004 6.0640 0.3154 2.3984 0.5701 10.7501 0.0007 4.8188 5.0367 0.0013 7.6090 0.0353 12.3100 7.2522 26.9288 0.0134 0.0001 0.2537 5.2370 59.5672 86.3206 0.0015 54.4361 21.2192 0.0003 0.3232 0.0008 0.2560 2.9544 0.0000 58.5460 5.3364 76.0896 31.5046 0.0400 523.3944 8.9062 0.0000 1.8691 262.8199 124.2917 52.2651 0.0040 98.4277 0.0001 0.0097 54.1683 0.0007 0.4974 0.3721 2.9153 0.0015 17.7547 0.0813
temp: 298.150 k
press: 1.00000 atm
elementType: 8 8 8 8 8 8 8 8 7 7 7 7 6 6 6 6 6 6 6 6 6 6 1 1 1 1
symmnumber: 1
zpe: 388476.6 jmol-1
zpe.correction: 0.147963 hartree
zpe.thermalcorrener: 0.165801 hartree
zpe.thermalcorrenthalpy: 0.166745 hartree
zpe.thermalcorrgfe: 0.101519 hartree
zpe.sumelectzpe: -1202.339546 hartree
zpe.sumelectthermal: -1202.321708 hartree
zpe.sumelectthermalent: -1202.320764 hartree
zpe.sumelectthermalfe: -1202.385990 hartree
dipole: 0.0012 0.0000 -0.0006
dipole: 0.0014
quadrupole: -174.9317 -108.0800 -127.9233
quadrupole: -0.0004 -0.0002 0.0467
quadrupole: -37.9534 28.8984 9.0550 -0.0004 -0.0002 0.0467
hfenergy: -1202.4875093 hartree
pointgroup: C01 [X(C10H4N4O8)]
dipole: -0.0004784 0.0000166 0.0002555 debye
dipolederiv: -0.5810249 -0.0080369 0.1643209 0.0665351 -0.5093103 0.1953218 0.0743503 0.1497084 -0.409547 -0.5815057 0.0071647 0.1643233 -0.0660907 -0.5066845 -0.1961639 0.0729379 -0.1502973 -0.4115419 -0.581039 0.00802 -0.1643104 -0.0665646 -0.5093172 0.1953536 -0.0743416 0.1497116 -0.4095725 -0.5814727 -0.0071134 -0.1643579 0.0661012 -0.5066756 -0.196118 -0.0730017 -0.1502977 -0.4115755 -0.5832804 0.2632006 0.017533 0.2551701 -0.5607212 0.1450821 0.0772958 0.0866448 -0.2783145 -0.5829935 -0.2630156 0.0155943 -0.2550714 -0.5588687 -0.1471505 0.0757059 -0.0887556 -0.2797304 -0.5833246 -0.2632174 -0.0175417 -0.2552018 -0.5606684 0.1450631 -0.0773069 0.0866561 -0.2783181 -0.5829344 0.2630208 -0.0156595 0.2551196 -0.5589325 -0.1471114 -0.0757665 -0.0886553 -0.2797388 1.4039407 -0.3202413 -0.2892629 -0.3303395 0.8657154 -0.3830784 -0.217429 -0.2867681 0.5483846 1.4026041 0.3210481 -0.2858581 0.3304994 0.860877 0.3859424 -0.212461 0.2895705 0.5520179 1.4039291 0.320228 0.2892745 0.3303754 0.8656744 -0.3831112 0.2174077 -0.2868185 0.5484385 1.4025574 -0.321174 0.2860458 -0.3306164 0.8609633 0.3858221 0.2126454 0.2894172 0.5520813 -0.1607987 0.000007 -0.0000015 -0.0000162 0.0881095 0.089092 -0.0000427 0.090422 -0.0106639 -0.1618083 0.0000007 -0.0000214 0.0000124 0.0878638 -0.0878614 0.0000217 -0.0896932 -0.0113136 -0.2501479 0.0694212 0.0687127 -0.0385933 0.1374874 0.0468973 0.0722111 0.0689873 0.0474534 -0.2472292 -0.0688966 0.0672466 0.0376274 0.1386979 -0.0467406 0.0699671 -0.0690012 0.0470977 -0.2500334 -0.0693604 -0.0687171 0.0385954 0.1374909 0.0469021 -0.0721426 0.0689927 0.0474559 -0.2473114 0.0689815 -0.0673073 -0.037606 0.1386817 -0.0467343 -0.0700504 -0.0689571 0.0470695 -0.0020732 -0.2410152 0.0053334 0.0167078 -0.0855517 0.0035486 -0.0848579 0.0428267 -0.0530524 -0.0041601 0.2410227 0.0063752 -0.0149546 -0.085016 -0.0042034 -0.0855161 -0.0430824 -0.0531049 -0.0021325 0.2409915 -0.0053352 -0.0166753 -0.0855635 0.0035804 0.0848686 0.0428285 -0.0530509 -0.0041198 -0.2410322 -0.0063748 0.0149891 -0.0849979 -0.0041643 0.0855237 -0.0431186 -0.0530901 0.0938191 0.0333413 0.0103196 0.0150245 0.1078426 -0.0145266 0.0441121 0.0059935 0.1506791 0.0933551 -0.0334795 0.0103087 -0.0153197 0.1075335 0.0144483 0.0439208 -0.0061614 0.1506349 0.0938038 -0.0333455 -0.0103341 -0.0150257 0.1078303 -0.0145321 -0.0441151 0.0060092 0.1506698 0.0933802 0.0334798 -0.010306 0.0153178 0.10754 0.0144425 -0.0439367 -0.0061619 0.1506319 unknown
polarizability: 241.9150859|-0.0032088|220.8867725|0.0078505|0.2606406|87.8572194 unknown
InChI: InChI=1S/C10H4N4O8/c15-11(16)5-1-2-6(12(17)18)10-8(14(21)22)4-3-7(9(5)10)13(19)20/h1-4H
charge 0 multiplicity 1
26 atoms
O  3.262502 -0.443599 -1.361184
O  -3.263398 -0.450467 1.358917
O  3.262335 0.443244 1.361351
O  -3.263153 0.450736 -1.359477
O  3.479516 -2.405265 -0.211522
O  -3.48022 -2.40447 0.195998
O  3.479724 2.404884 0.211687
O  -3.479978 2.404811 -0.196661
N  2.818924 -1.368612 -0.577563
N  -2.819435 -1.37087 0.569997
N  2.818975 1.368342 0.577704
N  -2.819263 1.371074 -0.57045
C  0.726119 -0.000029 -0.000081
C  -0.72615 0.000022 -0.000132
C  1.388262 -1.269981 -0.162373
C  -1.388055 -1.270548 0.158087
C  1.388326 1.269852 0.162377
C  -1.387973 1.270644 -0.158326
C  0.70068 -2.479487 -0.114081
C  -0.700152 -2.479799 0.107701
C  0.700814 2.479407 0.114225
C  -0.699987 2.479842 -0.107731
H  1.252367 -3.414598 -0.238417
H  -1.251726 -3.415342 0.229258
H  1.25254 3.414473 0.238727
H  -1.251492 3.415435 -0.22923
