program: Gaussian 09
title: 000138354
version: EM64L-G09RevD.01
frameworkgroup: C1[X(C20H14O2S2)]
method: RPBEPBE
basis: SDD
operation: Freq
keyword: #p
keyword: freq=noraman
keyword: PBEPBE/SDD
title: #p freq=noraman PBEPBE/SDD
converged: YES YES NO NO
title: Mulliken charges:
elementType: S S O O C C C C C C C C C C C C C C C C C C C C H H H H H H H H H H H H H H
charge: 0.310956 0.310890 -0.166068 -0.188326 -0.732452 0.574039 0.124029 0.113459 -0.394526 -0.369381 -0.207545 -0.215969 -0.215434 -0.215415 -0.218047 -0.224930 -0.224721 -0.217935 -0.210061 -0.216095 -0.216135 -0.210098 -0.226606 -0.226612 0.268831 0.269348 0.234495 0.236584 0.278213 0.248189 0.248172 0.278295 0.237250 0.230984 0.230987 0.237259 0.232189 0.232189
chargesum: 0.00000
title: Mulliken charges with hydrogens summed into heavy atoms:
elementType: S S O O C C C C C C C C C C C C C C C C C C C C
charge: 0.310956 0.310890 -0.166068 -0.188326 -0.732452 0.574039 0.124029 0.113459 -0.125695 -0.100033 0.026950 0.020614 -0.215434 -0.215415 0.060166 0.023258 0.023451 0.060360 0.027189 0.014889 0.014852 0.027160 0.005583 0.005576
polarizability: 2.82037709e+02 1.41972009e-02 2.17043823e+02 -8.87482676e-03 -7.85555663e+00 2.32958920e+02
1716.lowfreq: -4.7285 -0.0023 -0.0013 -0.0012 7.8800 10.2186 21.4319 23.5578 32.1964
frequency: 21.1692 22.8103 31.9187 33.5644 46.2853 52.6142 88.7147 95.5111 129.2016 141.8894 176.1933 193.5728 218.2588 248.8864 263.1892 278.2785 293.3421 357.5356 368.4971 394.4951 405.2111 405.6353 414.5986 426.3262 489.2287 493.2518 501.2251 513.1137 559.3463 596.2249 610.0061 610.1697 657.2421 677.6903 679.3307 696.0895 696.2119 700.0926 707.2274 747.3336 756.2478 761.0057 785.5088 797.0694 815.3836 852.9331 853.4240 895.4292 903.2256 931.9900 936.1780 968.9940 974.7462 981.1120 984.2011 985.8240 986.6448 1000.2418 1000.4123 1003.1197 1015.0198 1015.1015 1020.8531 1072.2873 1072.5384 1073.4367 1073.7504 1092.2688 1169.0534 1172.6271 1172.6582 1182.7093 1183.9717 1185.2423 1233.9855 1277.1644 1302.6003 1303.1591 1374.2953 1374.6759 1406.5620 1425.7312 1426.3724 1452.0281 1456.8992 1457.7544 1457.8355 1585.2831 1585.8380 1586.4343 1586.7009 1605.8772 1616.7463 1712.7742 3129.7140 3129.7232 3135.4380 3141.4417 3141.4521 3148.4060 3154.2145 3154.2923 3159.2588 3164.0577 3164.1367 3172.2661 3174.4087 3174.5348
redmass: 5.8623 4.7927 5.7433 5.8365 4.0801 5.4238 8.2131 5.9117 7.5829 5.3971 6.9522 5.0173 5.4017 6.3792 6.8008 6.5233 8.6693 12.4864 9.9575 9.1980 2.8638 2.8982 3.3522 10.9108 3.7091 3.9551 4.3462 7.8687 9.1156 9.6575 6.4702 6.4824 4.9933 6.7663 6.7738 2.2575 2.5495 5.1404 4.2357 2.9935 1.5232 2.2781 1.7346 3.2443 9.1425 1.2424 1.2600 1.4347 5.2331 1.3669 1.5138 1.3993 3.2300 1.4100 2.0209 5.8706 5.5008 1.3253 1.3288 1.3363 3.4276 3.4524 2.0484 2.2499 1.7251 1.6610 2.1556 2.2062 1.1135 1.0551 1.0552 1.7401 1.1131 1.3345 3.5771 1.5040 1.3131 1.3117 9.7580 9.8515 8.1766 2.0811 2.0856 2.5407 2.5895 2.0789 2.0792 6.1824 6.1350 6.0783 6.1291 7.7067 7.2880 12.9752 1.0852 1.0852 1.0861 1.0890 1.0890 1.0899 1.0935 1.0935 1.0957 1.0972 1.0971 1.1004 1.1000 1.1001
irintensity: 0.7349 0.5471 0.0568 0.3620 0.0854 2.2753 0.4778 1.0879 0.0683 0.4262 0.6433 2.7087 0.0006 0.9838 1.7458 0.0084 3.7328 0.5904 4.1167 2.1647 0.2755 0.0193 0.8367 0.3263 3.0220 18.1807 6.4422 0.7194 5.0699 2.2857 0.1047 0.1928 7.4555 27.1834 0.0457 27.6035 40.4224 4.7999 136.0748 32.1389 48.5628 17.0942 45.9168 7.0639 184.6062 0.0302 5.8873 2.7011 1.0107 2.4096 6.9742 0.3343 50.1492 0.2175 14.9466 8.7810 4.3758 0.0447 0.1301 0.0301 18.2647 2.6176 4.5607 1.5029 0.0154 12.9373 0.0223 3.1983 5.3781 0.0708 0.0401 4.8008 6.1462 0.9834 49.2402 4.1227 0.0160 2.0580 0.0032 2.7961 2.7122 0.5712 20.9077 11.0226 10.7725 33.7147 7.2511 2.0963 2.0716 6.4534 0.6755 2.5445 10.0657 302.9817 0.1603 0.8892 2.1778 4.0624 12.2080 5.0948 20.5215 18.2520 6.4697 11.8543 16.4550 18.6163 17.7955 4.8335
temp: 298.150 k
press: 1.00000 atm
elementType: 16 16 8 8 6 6 6 6 6 6 6 6 6 6 6 6 6 6 6 6 6 6 6 6 1 1 1 1 1 1 1 1 1 1 1 1 1 1
symmnumber: 1
zpe: 730252.9 jmol-1
zpe.correction: 0.278139 hartree
zpe.thermalcorrener: 0.298801 hartree
zpe.thermalcorrenthalpy: 0.299745 hartree
zpe.thermalcorrgfe: 0.225638 hartree
zpe.sumelectzpe: -1715.450118 hartree
zpe.sumelectthermal: -1715.429456 hartree
zpe.sumelectthermalent: -1715.428511 hartree
zpe.sumelectthermalfe: -1715.502619 hartree
dipole: 0.0032 5.2095 -2.2530
dipole: 5.6758
quadrupole: -133.1741 -147.4088 -151.7626
quadrupole: 0.0027 0.0004 -7.2702
quadrupole: 10.9411 -3.2936 -7.6474 0.0027 0.0004 -7.2702
hfenergy: -1715.7282568 hartree
pointgroup: C01 [X(C20H14O2S2)]
dipole: -0.0013551 2.2256687 -0.1810458 debye
polarizability: 282.0377101|-0.015352|227.0787125|0.0054449|10.9871267|222.9240296 unknown
InChI: InChI=1S/C20H14O2S2/c21-19-17-13-7-8-14-18(17)20(22-19,23-15-9-3-1-4-10-15)24-16-11-5-2-6-12-16/h1-14H
charge 0 multiplicity 1
38 atoms
S  -1.493982 -1.188986 2.057963
S  1.494234 -1.187437 2.058753
O  0.000989 -1.639713 -0.254506
O  0.001405 -1.344939 -2.583241
C  0.000199 -0.769549 0.942443
C  -0.000393 0.635898 0.394869
C  0.000086 0.584831 -1.015712
C  0.001469 -0.829922 -1.455937
C  -0.001426 1.870104 1.067606
C  -0.000593 1.752782 -1.803229
C  -0.002031 3.050343 0.286868
C  -0.001627 2.995812 -1.133413
C  -2.865421 -0.725946 0.911164
C  2.865812 -0.72464 0.912023
C  -3.233434 -1.601308 -0.137633
C  3.574784 0.479569 1.132336
C  -3.574145 0.478413 1.131436
C  3.233669 -1.600057 -0.136778
C  -4.317789 -1.257933 -0.978045
C  4.666582 0.8080 0.296207
C  -4.665847 0.807062 0.295268
C  4.318124 -1.256902 -0.977147
C  -5.035719 -0.058344 -0.760969
C  5.036307 -0.057471 -0.760026
H  -0.001834 1.911311 2.161456
H  -0.000203 1.684681 -2.895679
H  -0.002876 4.026423 0.784832
H  -0.002108 3.92728 -1.709301
H  -2.677437 -2.531302 -0.289441
H  3.274875 1.145054 1.948144
H  -3.274105 1.143853 1.947233
H  2.677437 -2.529898 -0.288655
H  -4.600515 -1.92996 -1.795349
H  5.221786 1.736766 0.467427
H  -5.220855 1.735951 0.466452
H  4.600722 -1.928966 -1.794465
H  -5.8801 0.19932 -1.410062
H  5.880761 0.200023 -1.409091
