program: Gaussian 09
title: 000138353
version: EM64L-G09RevD.01
frameworkgroup: C1[X(C6H12S)]
method: RPBEPBE
basis: SDD
operation: Freq
keyword: #pfreq=noraman
keyword: PBEPBE/SDD
title: #p freq=noraman PBEPBE/SDD
converged: YES YES NO NO
title: Mulliken charges:
elementType: S C C C C C C H H H H H H H H H H H H
charge: 0.177420 -0.319564 -0.340747 -0.678304 -0.685821 -0.283251 -0.513819 0.210445 0.210395 0.195019 0.194944 0.257329 0.257088 0.218479 0.212016 0.211948 0.232103 0.217424 0.226895
chargesum: 0.00000
title: Mulliken charges with hydrogens summed into heavy atoms:
elementType: S C C C C C C
charge: 0.177420 0.101276 0.049216 -0.163887 -0.043377 -0.051148 -0.069500
polarizability: 1.33564361e+02 -3.67217792e-01 6.99655409e+01 -6.26620184e-02 -2.97873034e-02 5.16766993e+01
1716.lowfreq: -6.2845 -0.0033 -0.0033 -0.0024 6.7043 19.5599 36.6022 42.2616 86.9258
frequency: 34.2879 42.0168 86.9240 91.2103 113.7966 199.4701 224.9513 279.0775 373.6138 421.9685 567.1364 665.3666 706.8827 740.6362 789.4676 883.1592 893.5772 913.8361 946.8395 1023.5302 1031.7422 1056.5813 1076.3794 1105.2599 1204.3926 1235.2231 1272.3884 1276.4720 1294.9412 1309.9375 1352.7896 1389.8806 1394.3828 1452.4842 1470.9348 1476.3683 1477.2682 1488.9103 1602.3476 2969.4212 2976.1102 2983.8056 3008.2484 3012.2771 3041.9346 3072.9346 3076.5556 3087.2251 3097.8882 3127.7352 3208.7949
redmass: 2.4276 2.1640 3.6217 2.1486 2.0673 3.5156 1.1263 4.3760 3.0401 3.2313 1.5328 4.2888 6.1513 1.0697 1.1445 1.3817 1.7895 1.2009 1.0666 1.8412 2.3121 1.1358 2.4857 2.2691 1.5241 1.2181 1.2109 1.2096 1.0606 1.3162 1.5339 1.2097 1.1973 1.0886 1.0676 1.0422 1.0620 1.0868 4.1630 1.0584 1.0369 1.0591 1.0556 1.1002 1.1037 1.1014 1.0994 1.1088 1.0584 1.0962 1.1151
irintensity: 0.0524 0.2340 0.1644 1.0572 0.0048 0.4658 0.0247 1.1434 0.2079 1.7572 17.5439 32.6042 5.4207 12.6637 0.1802 64.2612 6.4705 1.0282 54.5863 12.6421 19.1954 0.3331 1.5784 6.2080 0.7052 14.0419 5.5477 0.5786 0.1335 12.6516 8.3000 7.3346 8.8136 5.1795 1.0087 13.2049 3.4574 16.1061 91.4318 21.5596 30.9341 33.5633 35.6611 3.8623 13.8780 49.7990 49.1919 64.1662 3.2107 8.6912 14.2383
temp: 298.150 k
press: 1.00000 atm
elementType: 16 6 6 6 6 6 6 1 1 1 1 1 1 1 1 1 1 1 1
symmnumber: 1
zpe: 428438.7 jmol-1
zpe.correction: 0.163184 hartree
zpe.thermalcorrener: 0.173197 hartree
zpe.thermalcorrenthalpy: 0.174141 hartree
zpe.thermalcorrgfe: 0.126354 hartree
zpe.sumelectzpe: -633.286167 hartree
zpe.sumelectthermal: -633.276154 hartree
zpe.sumelectthermalent: -633.275209 hartree
zpe.sumelectthermalfe: -633.322996 hartree
dipole: 1.4359 1.5466 0.0003
dipole: 2.1104
quadrupole: -50.2337 -51.2069 -54.8222
quadrupole: -1.6141 -0.0053 -0.0204
quadrupole: 1.8539 0.8807 -2.7346 -1.6141 -0.0053 -0.0204
hfenergy: -633.4493506 hartree
pointgroup: C01 [X(C6H12S1)]
dipole: -0.5552082 0.6171232 -0.0171732 debye
dipolederiv: -0.6714699 -0.0530052 0.0033811 -0.3748218 -0.0604754 -0.0006004 0.0130599 -0.00181 -0.1011719 -0.1018458 -0.0100102 0.0007382 0.209333 0.0383055 0.0031745 -0.0057657 0.003498 0.1529574 0.0031962 -0.0071317 0.0005364 -0.1478762 0.1205814 0.0022313 0.0046567 0.0017133 0.1873289 0.4359922 -0.1690451 0.0049062 -0.2427473 0.0748135 0.0036533 0.0063787 0.0036924 0.1808484 -0.0790487 -0.03481 0.0013416 0.035246 0.0502846 0.0011357 -0.0008539 0.0014116 0.0940944 0.8679048 0.2587866 -0.0119078 0.5327939 0.1298124 -0.0094626 -0.019763 -0.0086469 -0.2009224 -0.6278996 -0.0682458 0.0023482 -0.0690547 0.071334 -0.0124085 0.0020665 -0.0122881 -0.4435091 0.0673358 0.0041868 -0.0104185 -0.0212297 -0.02685 -0.1084967 -0.0131514 -0.1164324 -0.0591366 0.0676789 0.0053728 0.0095627 -0.0199452 -0.0136925 0.105843 0.013733 0.1136643 -0.0724287 0.033279 -0.0318334 -0.0326038 0.000022 -0.0495285 -0.1219198 -0.0130198 -0.1489411 -0.0799236 0.0334674 -0.0293559 0.0339667 0.0011379 -0.0338381 0.1192426 0.0125627 0.1463949 -0.0957941 -0.0242756 0.0369483 -0.0009321 0.0663144 -0.0405835 0.1015656 0.0086827 0.1039695 -0.0551093 -0.0240901 0.036349 -0.0016306 0.0649447 -0.0533958 -0.1019546 -0.0131154 -0.1043119 -0.0425149 -0.1687274 0.1067347 -0.0030444 0.1369434 -0.0085888 0.0034518 -0.0040862 0.0034284 0.1025834 0.0778566 -0.0057619 -0.0154881 -0.0558352 -0.0011674 0.119211 0.0358106 0.1314588 -0.093692 0.0780943 -0.004776 0.0157229 -0.0579537 -0.0171897 -0.1239115 -0.0323411 -0.1362378 -0.0777373 -0.0100918 0.0379153 0.0000498 -0.0330825 -0.1055192 0.007219 0.0029281 0.0070696 0.1864371 -0.054148 -0.0921083 0.003329 -0.080138 0.0025789 0.0053956 0.0030164 0.0052719 0.2106031 0.0967916 0.0197902 0.0001424 0.055949 -0.0768813 0.0066306 -0.0007989 0.0070953 0.2070873 unknown
polarizability: 133.5594917|-0.6459309|69.9559781|-0.2030201|-0.5046809|51.6911316 unknown
InChI: InChI=1S/C6H12S/c1-3-5-6-7-4-2/h4H,2-3,5-6H2,1H3
charge 0 multiplicity 1
19 atoms
S  1.36827 -0.810049 0.035748
C  -1.414186 -0.377373 0.026532
C  -2.643957 0.562867 0.001411
C  -0.091995 0.405741 0.000375
C  -3.978213 -0.21387 0.026442
C  2.744836 0.381286 -0.001501
C  4.056743 0.037891 0.00095
H  -1.457021 -1.062939 -0.842924
H  -1.453181 -1.010188 0.935326
H  -2.598363 1.250658 0.870092
H  -2.601582 1.199082 -0.905927
H  -0.006362 1.009466 -0.920177
H  -0.00361 1.064997 0.881723
H  -4.843557 0.47328 0.0052
H  -4.059611 -0.83308 0.939369
H  -4.060214 -0.889055 -0.845866
H  2.428534 1.432057 -0.025845
H  4.828301 0.814784 -0.021622
H  4.395767 -1.003253 0.024993
