program: Gaussian 09
title: 000138350
version: EM64L-G09RevD.01
frameworkgroup: C1[X(C2H2O)]
method: RPBEPBE
basis: SDD
operation: Freq
keyword: #p
keyword: freq=noraman
keyword: PBEPBE/SDD
title: #p freq=noraman PBEPBE/SDD
converged: NO YES NO NO
title: Mulliken charges:
elementType: O C C H H
charge: -0.113671 -0.643529 0.227529 0.264804 0.264867
chargesum: 0.00000
title: Mulliken charges with hydrogens summed into heavy atoms:
elementType: O C C
charge: -0.113671 -0.113858 0.227529
polarizability: 4.03437765e+01 8.21675625e-04 1.42226807e+01 -8.25363524e-03 -7.09082394e-06 1.04044787e+01
1716.lowfreq: -40.1702 -0.0013 -0.0011 -0.0007 10.9641 13.7887 418.8854 504.6056 689.4342
frequency: 418.8814 504.6039 689.4334 969.2105 1116.6603 1368.8625 2107.8091 3137.2799 3242.5315
redmass: 2.4138 9.6850 1.2484 1.7925 3.3503 1.3091 11.2480 1.0600 1.1138
irintensity: 0.1226 5.4829 209.1931 11.7156 13.0835 31.0835 447.5307 30.4483 3.3675
temp: 298.150 k
press: 1.00000 atm
elementType: 8 6 6 1 1
symmnumber: 1
zpe: 81078.5 jmol-1
zpe.correction: 0.030881 hartree
zpe.thermalcorrener: 0.034417 hartree
zpe.thermalcorrenthalpy: 0.035361 hartree
zpe.thermalcorrgfe: 0.007219 hartree
zpe.sumelectzpe: -152.371900 hartree
zpe.sumelectthermal: -152.368365 hartree
zpe.sumelectthermalent: -152.367421 hartree
zpe.sumelectthermalfe: -152.395563 hartree
dipole: 1.7974 -0.0004 0.0059
dipole: 1.7974
quadrupole: -18.0746 -15.1500 -19.1614
quadrupole: 0.0010 0.0126 0.0000
quadrupole: -0.6126 2.3120 -1.6994 0.0010 0.0126 0.0000
hfenergy: -152.4027814 hartree
pointgroup: C01 [X(C2H2O1)]
dipole: -0.7071585 -0.0007973 0.0017686 debye
dipolederiv: -1.3494245 0.0005538 -0.001371 0.0008825 -0.1921414 -0.024474 -0.0003761 -0.0244749 -0.165257 -0.8849693 0.0003848 -0.0007626 0.0003993 -0.279936 0.2474525 -0.0018766 0.2474533 -0.5517397 1.9350363 -0.0007134 0.0015656 -0.0007221 0.2247374 -0.0174256 0.0009005 -0.0174252 0.2438755 0.149659 0.0297342 0.0179441 0.0003852 0.1239683 -0.1028581 0.0010701 -0.1031513 0.2362279 0.1496985 -0.0299595 -0.017376 -0.0009448 0.1233718 -0.1026949 0.0002821 -0.1024019 0.2368933 unknown
polarizability: 40.3437571|-0.0139375|13.2325911|0.0213566|1.6733396|11.3945877 unknown
InChI: InChI=1S/C2H2O/c1-2-3/h1H2
charge 0 multiplicity 1
5 atoms
O  1.263293 -0.000548 0.000314
C  -1.275445 0.000753 -0.001431
C  0.055012 0.000631 -0.000205
H  -1.829947 0.810069 0.479504
H  -1.829312 -0.810706 -0.479482
