program: Gaussian 09
title: 000138348
version: EM64L-G09RevD.01
frameworkgroup: C1[X(C8H6O3)]
method: RPBEPBE
basis: SDD
operation: Freq
keyword: #p
keyword: freq=noraman
keyword: PBEPBE/SDD
title: #p freq=noraman PBEPBE/SDD
converged: NO NO NO NO
title: Mulliken charges:
elementType: O O O C C C C C C C C H H H H H H
charge: -0.227351 -0.154852 -0.154844 0.113709 0.113689 -0.520870 -0.520867 -0.186386 -0.186382 0.129415 0.129419 0.252954 0.252954 0.252953 0.252954 0.226753 0.226753
chargesum: 0.00000
title: Mulliken charges with hydrogens summed into heavy atoms:
elementType: O O O C C C C C C C C
charge: -0.227351 -0.154852 -0.154844 0.113709 0.113689 -0.014962 -0.014960 0.040367 0.040371 0.129415 0.129419
polarizability: 8.92749513e+01 2.77797214e-04 1.26332893e+02 -1.20967077e-03 1.55868182e-03 4.44774279e+01
1716.lowfreq: 0.0002 0.0004 0.0007 11.6405 14.0298 14.7642 84.3179 111.8292 161.9689
frequency: 84.2861 111.8055 161.9596 223.5784 252.4241 320.3970 389.8859 413.6111 471.7075 486.4244 606.1694 631.7451 653.6564 670.4323 696.6109 720.0865 757.6931 778.8169 893.1292 943.9612 945.5903 967.7225 988.8663 1006.0737 1062.0512 1172.0600 1181.7783 1184.7671 1203.6791 1226.3569 1349.2805 1371.6868 1395.6352 1443.8525 1448.9090 1656.3740 1669.9651 1696.8959 1731.7984 2959.5722 2960.6753 2988.7976 2989.0540 3116.9950 3146.3751
redmass: 2.6587 3.9196 11.3878 6.6316 3.1185 10.4885 2.1593 4.0457 8.9787 6.6925 14.1754 9.7178 2.0892 5.4369 1.8733 7.5297 8.6638 10.5560 3.5145 1.6577 1.8653 2.4788 1.4149 4.6778 4.5304 1.0902 1.1151 1.2934 2.7466 2.0323 1.9279 1.5874 3.0604 1.1232 1.0725 7.9080 13.1414 7.1561 12.8525 1.0608 1.0611 1.0966 1.0968 1.0849 1.0992
irintensity: 5.6578 0.0000 1.0555 2.5296 1.0094 8.3731 0.0000 0.0000 0.3285 8.0687 0.4142 1.3745 81.6723 1.6702 8.3508 0.0000 110.4363 43.7308 7.6685 0.0000 8.2277 4.6544 0.0000 63.9914 0.1044 0.6574 0.0000 35.0818 70.0175 4.2510 0.8352 1.2597 1.3054 1.3734 48.1122 40.2732 494.0237 5.2566 52.2170 0.6362 16.7184 15.2675 0.0217 3.3450 38.6057
temp: 298.150 k
press: 1.00000 atm
elementType: 8 8 8 6 6 6 6 6 6 6 6 1 1 1 1 1 1
symmnumber: 1
zpe: 317807.1 jmol-1
zpe.correction: 0.121046 hartree
zpe.thermalcorrener: 0.129855 hartree
zpe.thermalcorrenthalpy: 0.130799 hartree
zpe.thermalcorrgfe: 0.086889 hartree
zpe.sumelectzpe: -533.325272 hartree
zpe.sumelectthermal: -533.316464 hartree
zpe.sumelectthermalent: -533.315519 hartree
zpe.sumelectthermalfe: -533.359430 hartree
dipole: 5.9835 0.0000 0.0006
dipole: 5.9835
quadrupole: -69.0228 -68.1501 -61.4522
quadrupole: -0.0002 -0.0004 -0.0002
quadrupole: -2.8144 -1.9417 4.7562 -0.0002 -0.0004 -0.0002
hfenergy: -533.4463186 hartree
pointgroup: C01 [X(C8H6O3)]
dipole: -2.3540941 0.0000584 -0.0002464 debye
dipolederiv: -0.8073576 -0.000003 0.0000109 -0.0000112 -1.1903762 0.0000214 0.0000971 0.0000222 -0.2184621 -0.5240566 0.2824363 -0.0000414 0.1500221 -1.0019161 0.0000837 -0.0000211 0.0000864 -0.3039904 -0.5240756 -0.2824608 -0.0000286 -0.1500452 -1.0019259 -0.0000523 -0.0000145 -0.000055 -0.3039906 -0.0880632 0.3888582 0.0000199 0.4812722 -0.0212353 0.000049 0.0000008 0.0000826 -0.037379 -0.0881084 -0.3888593 0.0000375 -0.4812716 -0.0212074 -0.0000491 0.0000207 -0.0000784 -0.037381 -0.0921765 -0.0425671 0.0000257 -0.0391699 -0.1438377 -0.0000269 0.0000225 -0.000158 0.2138745 -0.0921661 0.0425615 0.0000273 0.0391675 -0.1438373 0.0000405 0.0000268 0.0001778 0.2138746 0.1832181 -0.0612642 -0.0001186 -0.1260777 0.0540838 0.0000175 -0.0001123 0.0000661 -0.2332444 0.183222 0.0612568 -0.0001191 0.1260683 0.0540751 -0.0000275 -0.0001138 -0.0000919 -0.2332446 0.9826466 -0.23264 0.0000447 -0.1194818 1.5960791 -0.0002101 -0.0000313 -0.0001913 0.304724 0.9826721 0.2326735 0.0000333 0.1195182 1.5960981 0.000152 -0.000036 0.0001312 0.3047324 0.0307669 0.0141865 -0.007249 0.0106653 0.0382592 0.0838327 -0.0014123 0.1171911 0.0006203 0.0307777 0.014152 0.0072399 0.0106395 0.0383148 -0.0838094 0.0014316 -0.1171608 0.0005138 0.0307775 -0.0141522 0.0072417 -0.0106378 0.0383219 0.0838063 0.0014364 0.1171574 0.0005049 0.0307664 -0.0141868 -0.0072541 -0.0106663 0.0382528 -0.0838331 -0.0014189 -0.1171905 0.0006289 -0.1194229 -0.069545 0.0000671 -0.0764669 0.0354288 0.0000218 0.0000653 0.0000357 0.1641096 -0.1194204 0.0695535 0.0000631 0.0764753 0.0354223 -0.0000166 0.0000593 -0.0000246 0.1641091 unknown
polarizability: 89.2749513|0.0005479|126.3328926|-0.0012097|-0.0015587|44.4774279 unknown
InChI: InChI=1S/C8H6O3/c9-7-5-3-1-2-4-6(5)8(10)11-7/h1-2H,3-4H2
charge 0 multiplicity 1
17 atoms
O  2.158359 -0.000034 -0.000265
O  1.751466 -2.31958 0.000156
O  1.751541 2.319514 0.000053
C  -0.120196 -0.683211 -0.000116
C  -0.120163 0.683219 -0.000148
C  -1.346743 -1.544254 -0.000162
C  -1.346683 1.544316 -0.000216
C  -2.600134 -0.679415 0.000182
C  -2.600101 0.679526 0.000173
C  1.29629 -1.168563 -0.000024
C  1.296336 1.168523 -0.000076
H  -1.337413 -2.225809 0.876616
H  -1.337642 -2.225344 -0.877311
H  -1.337564 2.225363 -0.877397
H  -1.33731 2.225902 0.876534
H  -3.557499 -1.215805 0.000471
H  -3.557445 1.21595 0.000431
