program: Gaussian 09
title: 000138347
version: EM64L-G09RevD.01
frameworkgroup: C1[X(C10H8O)]
method: RPBEPBE
basis: SDD
operation: Freq
keyword: #pfreq=noraman
keyword: PBEPBE/SDD
title: #p freq=noraman PBEPBE/SDD
converged: NO NO NO NO
title: Mulliken charges:
elementType: O C C C C C C C C C C H H H H H H H H
charge: -0.296936 0.301156 0.301151 -0.339914 -0.339911 -0.339198 -0.339198 -0.186302 -0.186303 -0.186382 -0.186383 0.242909 0.242908 0.242774 0.242776 0.206709 0.206709 0.206718 0.206717
chargesum: 0.00000
title: Mulliken charges with hydrogens summed into heavy atoms:
elementType: O C C C C C C C C C C
charge: -0.296936 0.301156 0.301151 -0.097005 -0.097003 -0.096424 -0.096422 0.020407 0.020406 0.020336 0.020334
polarizability: 1.74316999e+02 -2.14143625e-05 1.27511130e+02 8.68972821e-03 -3.36686116e-05 4.93658575e+01
1716.lowfreq: -21.1416 -9.6954 -4.6515 -0.0002 0.0003 0.0009 131.9539 174.4859 301.1292
frequency: 131.9529 174.4851 301.1292 331.9203 340.7267 391.0812 401.6545 441.3284 483.8669 597.2742 629.8478 645.5644 686.1926 726.3187 746.4875 755.9064 790.9844 824.7244 844.1160 866.5077 872.3238 906.8527 942.7001 952.6171 963.6725 964.3641 968.0004 1101.3099 1141.5294 1194.6839 1197.5388 1225.9217 1234.1046 1271.6606 1311.3585 1387.8533 1390.7552 1439.2258 1450.5850 1532.6910 1535.5325 1552.9902 1608.4228 3104.8595 3105.7023 3116.8643 3119.5931 3129.1651 3132.6191 3142.6671 3145.2943
redmass: 3.5520 4.2595 4.8585 2.8688 3.9811 7.3739 6.3029 4.1387 4.4788 3.2610 3.3587 3.6335 1.4470 3.3454 1.6096 5.0385 1.3324 4.7618 1.4846 1.5199 4.9604 1.4703 6.8014 3.0167 2.2910 1.3104 1.3245 2.2853 1.4337 1.2075 1.3959 1.5084 1.6393 1.4409 2.0216 4.7515 1.4803 2.1207 1.8932 7.8708 4.3460 4.1701 7.2724 1.0835 1.0836 1.0874 1.0873 1.0934 1.0928 1.0967 1.0959
irintensity: 0.0000 3.4485 1.9270 0.7277 1.0236 4.8084 0.0000 2.2236 6.3853 0.0000 47.7745 0.8089 1.1549 3.6206 112.7133 0.8090 0.0000 53.6658 24.5031 0.9096 0.0001 2.3534 6.2920 7.8055 3.9758 0.0071 2.3698 24.6192 0.0109 7.1460 3.6851 0.0009 3.2936 0.8659 4.9299 0.3352 2.9956 1.6039 0.0013 0.0086 5.2167 21.4515 0.0004 1.1285 2.7599 17.4004 0.3088 0.0079 39.7517 65.2024 4.0301
temp: 298.150 k
press: 1.00000 atm
elementType: 8 6 6 6 6 6 6 6 6 6 6 1 1 1 1 1 1 1 1
symmnumber: 1
zpe: 384333.4 jmol-1
zpe.correction: 0.146385 hartree
zpe.thermalcorrener: 0.154437 hartree
zpe.thermalcorrenthalpy: 0.155381 hartree
zpe.thermalcorrgfe: 0.113924 hartree
zpe.sumelectzpe: -460.249988 hartree
zpe.sumelectthermal: -460.241936 hartree
zpe.sumelectthermalent: -460.240992 hartree
zpe.sumelectthermalfe: -460.282448 hartree
dipole: -0.0017 0.0000 -2.6832
dipole: 2.6832
quadrupole: -53.9461 -53.8226 -71.2219
quadrupole: 0.0000 -0.0049 0.0000
quadrupole: 5.7174 5.8409 -11.5584 0.0000 -0.0049 0.0000
hfenergy: -460.3963724 hartree
pointgroup: C01 [X(C10H8O1)]
dipole: 0.0056757 0.0000671 -1.0556493 debye
dipolederiv: -0.331674 0.0000234 -0.0006562 0.0000171 -0.5341137 -0.0000169 0.0000744 -0.0000144 -0.2829411 0.173299 0.0012039 0.000297 0.0017204 0.1768067 -0.2516705 0.000251 -0.1759127 0.1602002 0.1733045 -0.0012037 0.0002418 -0.0017155 0.1767551 0.251676 0.000217 0.1759133 0.1602513 -0.0311224 -0.0599048 -0.0028812 -0.0466523 0.018047 -0.0787623 -0.0587251 -0.0980979 -0.1567695 -0.0311469 0.0598955 -0.0028911 0.0466488 0.0180595 0.0787791 -0.0587415 0.0981019 -0.1567514 -0.0301627 0.0605318 0.0039434 0.0468539 0.0180161 -0.0786467 0.060037 -0.0985014 -0.155528 -0.0301433 -0.0605486 0.0039154 -0.0468724 0.0179679 0.0786694 0.0600074 0.0985385 -0.1555067 0.0646731 0.0699083 -0.0520079 0.1726022 0.0373914 -0.0170782 0.0160573 -0.0122408 -0.1536313 0.064731 -0.0698974 -0.0520184 -0.1725989 0.0373317 0.0170878 0.0160398 0.0122652 -0.1536295 0.0636427 -0.0704073 0.0543644 -0.1735182 0.0379801 -0.0187238 -0.0142873 -0.0128123 -0.1530943 0.0635864 0.0704076 0.0543716 0.1735224 0.038029 0.0187601 -0.0142641 0.0128318 -0.1530906 0.073416 0.0095487 0.0114138 -0.0411171 -0.0499366 0.0823232 -0.0150784 0.0976898 0.1527102 0.0734082 -0.0095218 0.0114314 0.041147 -0.0499133 -0.0823424 -0.0150507 -0.0977134 0.1526907 0.0733468 -0.0107132 -0.0120848 0.0405939 -0.0502109 0.082832 0.0141129 0.098132 0.1523262 0.0733548 0.0107457 -0.0120649 -0.0405647 -0.0501911 -0.0828597 0.014127 -0.0981544 0.1523039 -0.110834 -0.087629 0.033778 -0.0845581 0.0394382 0.0231653 0.0346649 0.0236138 0.148025 -0.1108737 0.0875913 0.0337922 0.0845205 0.0394828 -0.0231696 0.0346768 -0.0236171 0.1480206 -0.1104208 0.0873853 -0.0364687 0.0839937 0.0395462 0.0238976 -0.037058 0.024502 0.1472103 -0.1103848 -0.0874158 -0.0364756 -0.0840226 0.0395139 -0.0239205 -0.0370605 -0.024524 0.1472039 unknown
polarizability: 174.3142499|0.0052174|127.5111307|0.5860996|0.0047139|49.3686064 unknown
InChI: InChI=1S/C10H8O/c1-2-6-10-8-4-3-7-9(5-1)11-10/h1-8H
charge 0 multiplicity 1
19 atoms
O  -0.022099 -0.00008 1.064078
C  -0.017101 1.140443 0.184325
C  -0.016843 -1.140492 0.184198
C  1.277433 1.581517 -0.17636
C  1.27779 -1.581235 -0.176538
C  -1.309084 1.581028 -0.187773
C  -1.30872 -1.581335 -0.187968
C  2.398936 0.716554 -0.157098
C  2.399098 -0.716023 -0.15718
C  -2.429225 0.716411 -0.180524
C  -2.42906 -0.716972 -0.18062
H  1.402194 2.601382 -0.561045
H  1.402783 -2.601034 -0.561329
H  -1.429508 2.600651 -0.574428
H  -1.428905 -2.600933 -0.574754
H  3.375575 1.18173 -0.344746
H  3.375844 -1.180957 -0.344876
H  -3.404538 1.180407 -0.378251
H  -3.40427 -1.181162 -0.378412
