program: Gaussian 09
title: 000138346
version: EM64L-G09RevD.01
frameworkgroup: C1[X(C12H19NO2)]
method: RPBEPBE
basis: SDD
operation: Freq
keyword: #p
keyword: freq=noraman
keyword: PBEPBE/SDD
title: #p freq=noraman PBEPBE/SDD
converged: YES YES NO NO
title: Mulliken charges:
elementType: O O N C C C C C C C C C C C C H H H H H H H H H H H H H H H H H H H
charge: -0.325328 -0.261100 -0.442118 0.207262 -0.539067 0.136998 0.211853 0.063173 -0.361965 -0.800019 -0.795641 -0.688699 0.157994 -0.207480 -0.679371 0.205344 0.197772 0.202320 0.210842 0.329727 0.242127 0.215196 0.250341 0.222627 0.244407 0.247842 0.211136 0.208626 0.222297 0.225716 0.224430 0.212053 0.225111 0.225591
chargesum: 0.00000
title: Mulliken charges with hydrogens summed into heavy atoms:
elementType: O O N C C C C C C C C C C C C
charge: -0.325328 -0.261100 -0.112391 0.207262 -0.135950 0.136998 0.211853 0.063173 0.051196 -0.092354 -0.080765 -0.046639 0.157994 0.242666 -0.016616
polarizability: 2.11802551e+02 9.34256023e+00 1.52397660e+02 -5.28856037e+00 5.32147018e-01 9.45396789e+01
1716.lowfreq: -76.8931 -38.2649 -7.0501 -0.0002 0.0002 0.0003 3.9289 13.3327 29.2975
frequency: -76.8467 -37.8567 29.0254 47.2280 54.8340 81.8436 89.7475 93.8148 104.3316 160.4967 175.1753 201.4318 220.3022 239.6291 252.2181 264.4476 271.9809 328.3109 334.3313 359.0485 404.2276 432.4395 550.0842 570.0476 616.0556 643.9501 680.3223 722.0184 727.0312 738.1745 750.8292 798.8122 803.5352 841.1039 873.6445 888.0857 972.4261 994.7157 1001.2203 1034.4543 1038.0562 1040.9028 1048.2470 1095.2656 1110.3919 1122.8395 1137.3104 1167.2533 1212.6018 1228.7689 1244.6881 1246.7385 1284.5339 1288.1855 1337.0830 1343.7983 1362.0841 1387.7074 1397.9288 1403.1956 1404.2128 1432.7917 1456.0706 1458.7770 1462.3767 1463.8079 1469.3075 1474.8340 1476.1900 1477.1043 1481.4633 1488.9175 1490.2394 1503.0226 1515.6797 1568.4075 1636.9779 2968.4671 2971.5236 2974.6908 2981.5454 2984.3783 2991.9934 3005.4510 3010.2997 3036.2441 3052.2162 3061.4331 3061.9501 3068.3413 3072.0335 3078.5887 3088.7976 3090.2511 3101.4506 3595.0176
redmass: 1.0437 1.0297 2.8775 3.2371 2.5665 2.0152 2.8305 4.1710 2.9542 2.8094 3.7501 3.9751 1.1936 2.4512 1.2420 2.2931 3.3254 3.7434 4.0671 4.4677 3.8400 5.3381 3.2628 3.9442 7.1473 1.1916 3.4964 7.5223 2.6239 1.7797 3.1251 1.1349 3.0823 2.1896 1.6602 1.9483 1.8258 1.8413 1.8230 1.4547 1.4816 3.4119 2.9885 2.1622 2.1768 1.9146 1.4646 3.1899 4.4843 1.4402 1.4601 1.1358 1.3974 1.1236 2.2503 1.7209 1.7469 1.2148 1.2758 1.2266 1.2656 2.5914 1.3959 1.1443 1.1356 1.0413 1.1245 1.0554 1.0552 1.0542 1.0934 1.0972 1.0947 2.6891 5.9756 5.8623 10.6526 1.0536 1.0411 1.0383 1.0608 1.0375 1.0356 1.0581 1.0988 1.1026 1.0968 1.1052 1.0968 1.1012 1.0991 1.0988 1.0985 1.0996 1.1025 1.0809
irintensity: 0.2821 0.0799 0.1948 0.3935 0.8424 0.4378 0.5547 0.5746 2.3208 1.1822 2.4613 4.7162 0.0340 0.8417 0.7446 0.4054 2.0606 6.3690 2.1446 7.2973 1.0620 1.4150 6.0318 3.7640 2.6316 72.4022 13.8499 6.9583 0.4916 6.9958 5.4510 4.4879 27.4010 3.4982 19.7252 4.9915 29.4250 140.1957 58.6446 8.5705 3.1363 265.4851 5.0236 6.3891 3.5314 63.2833 4.9698 23.1489 62.0854 30.5173 155.4105 0.7980 2.3321 1.1415 61.2366 21.7857 18.1063 11.9475 21.0262 16.4911 5.4220 49.2007 13.0170 23.2299 2.4153 11.1933 8.1947 7.9895 8.0468 10.0775 9.5261 6.3343 9.7258 22.8846 65.6566 57.4404 429.5151 4.1332 53.4545 41.4513 56.5645 22.9921 25.0779 27.9544 2.7547 16.0658 15.3735 3.1628 21.1881 79.2370 48.6746 18.3136 37.3500 23.7803 51.3394 81.2936
temp: 298.150 k
press: 1.00000 atm
elementType: 8 8 7 6 6 6 6 6 6 6 6 6 6 6 6 1 1 1 1 1 1 1 1 1 1 1 1 1 1 1 1 1 1 1
symmnumber: 1
zpe: 755464.5 jmol-1
zpe.correction: 0.287741 hartree
zpe.thermalcorrener: 0.304130 hartree
zpe.thermalcorrenthalpy: 0.305074 hartree
zpe.thermalcorrgfe: 0.242678 hartree
zpe.sumelectzpe: -672.736287 hartree
zpe.sumelectthermal: -672.719899 hartree
zpe.sumelectthermalent: -672.718955 hartree
zpe.sumelectthermalfe: -672.781351 hartree
dipole: 0.5108 3.6243 0.1616
dipole: 3.6637
quadrupole: -79.2279 -89.7330 -92.3133
quadrupole: -5.2595 -1.5622 -0.0763
quadrupole: 7.8635 -2.6416 -5.2219 -5.2595 -1.5622 -0.0763
hfenergy: -673.0240287 hartree
pointgroup: C01 [X(C12H19N1O2)]
dipole: -0.2301595 1.4220774 -0.0491464 debye
polarizability: 212.155302|-8.0639106|152.0468131|-5.4144785|-0.0569241|94.5377755 unknown
InChI: InChI=1S/C12H19NO2/c1-5-7-10-8(3)11(13-9(10)4)12(14)15-6-2/h13H,5-7H2,1-4H3
charge 0 multiplicity 1
34 atoms
O  2.940947 0.290779 -0.146191
O  2.30806 -1.971398 -0.001165
N  0.40971 1.181394 0.106522
C  -1.601771 0.177615 0.365222
C  -3.093739 -0.018808 0.507319
C  -0.600439 -0.850677 0.289798
C  -0.944385 1.429208 0.247419
C  0.649824 -0.201132 0.128847
C  -3.815987 -0.296542 -0.842413
C  -0.815632 -2.339433 0.379386
C  -1.504389 2.824489 0.280946
C  -5.335232 -0.504628 -0.668081
C  1.982623 -0.753419 -0.003892
C  4.35285 -0.154431 -0.293852
C  5.20888 1.105127 -0.395539
H  -3.301388 -0.861985 1.196041
H  -3.55097 0.8764 0.974503
H  -3.625561 0.547462 -1.534862
H  -3.363206 -1.189994 -1.315339
H  1.156061 1.867818 0.001622
H  -0.389043 -2.751221 1.313199
H  -1.889992 -2.590336 0.352799
H  -0.307689 -2.867936 -0.446362
H  -0.738813 3.57377 0.01166
H  -2.344811 2.937034 -0.427577
H  -1.887693 3.086166 1.285804
H  -5.543358 -1.358983 0.00377
H  -5.81246 0.391065 -0.226776
H  -5.828781 -0.708216 -1.635979
H  4.620352 -0.774817 0.581028
H  4.430077 -0.788468 -1.196148
H  6.273032 0.827565 -0.507002
H  4.916852 1.712482 -1.269937
H  5.106571 1.725852 0.511529
