program: Gaussian 09
title: 000138340
version: EM64L-G09RevD.01
frameworkgroup: C1[X(C12H19N)]
method: RPBEPBE
basis: SDD
operation: Freq
keyword: #pfreq=noraman
keyword: PBEPBE/SDD
title: #p freq=noraman PBEPBE/SDD
converged: YES YES NO NO
title: Mulliken charges:
elementType: N C C C C C C C C C C C C H H H H H H H H H H H H H H H H H H H
charge: -0.432864 -0.352721 -0.453334 -0.347506 -0.346475 -0.355652 -0.694690 0.463344 -0.369792 -0.429772 -0.221113 -0.195876 -0.277774 0.191179 0.191119 0.206592 0.207073 0.187539 0.187506 0.209784 0.209827 0.195505 0.195522 0.293215 0.210053 0.210065 0.217166 0.237427 0.210298 0.215264 0.216898 0.222194
chargesum: 0.00000
title: Mulliken charges with hydrogens summed into heavy atoms:
elementType: N C C C C C C C C C C C C
charge: -0.139648 0.029578 -0.039669 0.027539 0.073136 0.035375 -0.057407 0.463344 -0.132365 -0.219474 -0.005850 0.021022 -0.055580
polarizability: 2.01896539e+02 3.50772697e+00 1.30421148e+02 -1.20482083e-02 1.29344764e-04 8.28229461e+01
1716.lowfreq: -0.0010 0.0002 0.0005 6.6308 9.2405 21.9319 28.8477 50.1852 50.4425
frequency: 28.7229 48.9765 50.1833 71.4502 101.5069 132.8008 133.2721 144.8202 209.6041 224.9303 226.3866 258.3404 302.4043 398.2398 410.9046 414.9980 501.5425 506.0576 593.9501 615.2568 690.5001 725.8903 745.4146 753.7304 799.8006 815.1406 825.4979 866.4618 889.8553 893.8891 953.0712 971.6930 976.0482 994.0051 1006.3330 1023.7076 1038.7374 1065.7080 1080.6660 1081.6838 1106.4746 1138.1079 1155.8843 1168.1521 1186.8382 1199.7346 1233.5775 1249.9473 1275.2444 1281.6792 1291.5664 1297.7133 1305.3726 1328.6040 1341.5693 1357.4991 1367.8800 1386.9380 1388.8402 1431.9250 1464.6012 1466.4881 1473.1505 1476.2938 1480.3057 1481.0359 1488.5432 1501.2410 1512.0083 1588.6284 1627.4168 2920.6760 2954.3605 2955.5522 2957.6359 2964.8509 2971.2630 2972.4039 2990.9108 3004.9723 3023.4255 3041.9625 3068.8512 3072.2037 3105.1350 3121.4062 3133.6735 3150.0275 3164.7696 3570.1299
redmass: 3.8019 1.7709 3.8794 3.2251 1.7751 3.5040 2.4400 2.0803 4.7038 1.8579 1.6334 3.2416 1.1334 3.0825 2.9330 3.8454 3.3485 2.6690 5.5288 6.4112 1.8321 1.0656 1.1174 1.7552 1.1702 1.2427 5.0572 1.5241 1.8616 1.1971 1.3573 1.2899 5.8833 1.1346 4.3873 2.1925 2.9990 2.9023 1.7791 2.0177 2.3129 3.3302 1.5447 1.0490 1.1092 1.4865 1.3008 1.2627 1.4304 1.0902 1.1011 1.0949 1.4618 1.4839 1.5209 1.6387 1.7660 3.0671 1.2229 2.4340 1.0699 1.0766 1.0726 1.0425 1.3561 1.3726 1.0908 1.2526 2.0672 5.0955 6.2943 1.0568 1.0590 1.1028 1.0590 1.0588 1.0586 1.0366 1.0978 1.1015 1.1042 1.1049 1.1008 1.0993 1.0871 1.0857 1.0929 1.0935 1.1007 1.0769
irintensity: 0.1251 0.9134 0.1861 0.1025 6.5537 0.0750 0.0291 6.0324 0.1613 0.1468 0.0429 0.4517 84.3658 1.4112 0.0721 0.6886 1.8267 14.5688 1.0761 0.3325 42.2408 12.2657 3.0505 83.5056 0.4467 0.6432 8.3892 8.5486 4.6930 2.1349 0.0301 0.6153 5.6194 0.1247 0.3786 8.5031 3.0463 0.7345 8.0694 0.2294 2.5404 21.6604 0.1422 1.5588 12.1397 0.1496 4.4621 0.1360 12.5460 0.0151 0.2657 0.8794 11.8231 32.7735 9.6975 4.2492 1.9368 52.9162 12.9354 18.0351 0.0230 0.2710 7.0302 12.6837 0.3432 2.7404 22.3796 134.8815 114.3755 11.2600 229.3224 52.5689 1.5600 29.6291 0.3169 8.5640 144.8827 37.0737 0.5185 2.8023 0.1973 120.6686 97.7423 52.8164 16.7132 4.0174 32.9801 44.7328 14.9141 28.8633
temp: 298.150 k
press: 1.00000 atm
elementType: 7 6 6 6 6 6 6 6 6 6 6 6 6 1 1 1 1 1 1 1 1 1 1 1 1 1 1 1 1 1 1 1
symmnumber: 1
zpe: 740306.9 jmol-1
zpe.correction: 0.281968 hartree
zpe.thermalcorrener: 0.296487 hartree
zpe.thermalcorrenthalpy: 0.297432 hartree
zpe.thermalcorrgfe: 0.239001 hartree
zpe.sumelectzpe: -522.418239 hartree
zpe.sumelectthermal: -522.403719 hartree
zpe.sumelectthermalent: -522.402775 hartree
zpe.sumelectthermalfe: -522.461205 hartree
dipole: -2.6779 -0.6320 0.0153
dipole: 2.7515
quadrupole: -84.7700 -74.8093 -85.2981
quadrupole: -1.2338 0.0111 -0.0233
quadrupole: -3.1442 6.8165 -3.6723 -1.2338 0.0111 -0.0233
hfenergy: -522.7002069 hartree
pointgroup: C01 [X(C12H19N1)]
dipole: -1.0531187 -0.2505127 -0.0034082 debye
polarizability: 201.8815643|3.6262181|130.4149887|0.5688329|0.9524632|82.8440799 unknown
InChI: InChI=1S/C12H19N/c1-2-3-4-8-11-13-12-9-6-5-7-10-12/h5-7,9-10,13H,2-4,8,11H2,1H3
charge 0 multiplicity 1
32 atoms
N  0.775399 -0.690049 -0.011707
C  -2.918949 0.412312 -0.002296
C  -1.694544 -0.528859 -0.015799
C  -4.265024 -0.34628 -0.023642
C  -0.357522 0.237615 0.007025
C  -5.492975 0.592581 -0.013459
C  -6.834681 -0.171142 -0.033954
C  2.113552 -0.295476 0.003256
C  2.488733 1.081742 0.032299
C  3.148175 -1.281291 -0.01174
C  3.852358 1.446329 0.044824
C  4.502849 -0.900392 0.001186
C  4.872105 0.467575 0.02946
H  -2.877598 1.057844 0.899478
H  -2.869632 1.093439 -0.877072
H  -1.742586 -1.206931 0.861452
H  -1.733141 -1.169285 -0.921291
H  -4.318476 -1.02658 0.852051
H  -4.308499 -0.994192 -0.924104
H  -0.317793 0.879747 0.914735
H  -0.311845 0.920956 -0.869548
H  -5.448575 1.240628 0.885672
H  -5.439385 1.271809 -0.888738
H  0.569269 -1.688211 -0.025138
H  -6.917253 -0.803512 -0.938128
H  -6.927579 -0.833503 0.847445
H  -7.695592 0.522287 -0.027305
H  1.720668 1.861435 0.044995
H  2.877813 -2.345385 -0.034125
H  4.118178 2.510101 0.067147
H  5.277574 -1.676289 -0.01097
H  5.927176 0.759975 0.03939
