program: Gaussian 09
title: 000138338
version: EM64L-G09RevD.01
frameworkgroup: C1[X(C6H10)]
method: RPBEPBE
basis: SDD
operation: Freq
keyword: #p
keyword: freq=noraman
keyword: PBEPBE/SDD
title: #p freq=noraman PBEPBE/SDD
converged: NO NO NO NO
title: Mulliken charges:
elementType: C C C C C C H H H H H H H H H H
charge: -0.520822 -0.520822 0.056042 0.273295 -0.786582 -0.786582 0.237063 0.237066 0.237066 0.237063 0.215573 0.215570 0.237464 0.215571 0.215570 0.237465
chargesum: 0.00000
title: Mulliken charges with hydrogens summed into heavy atoms:
elementType: C C C C C C
charge: -0.046693 -0.046692 0.056042 0.273295 -0.117975 -0.117976
polarizability: 8.75540245e+01 2.12136239e-05 6.28296568e+01 3.25066572e-04 -1.13702956e-04 4.60761445e+01
1716.lowfreq: -13.3220 -7.8681 -0.0010 -0.0008 -0.0005 22.2149 148.4116 167.3563 179.5860
frequency: 148.4112 167.3415 179.5795 203.2536 224.2879 322.8761 438.4001 518.0151 601.6078 750.9722 854.2848 860.2634 943.6261 981.1864 996.8730 1007.9559 1017.5475 1060.1363 1067.0740 1081.5898 1121.4137 1212.5203 1239.4966 1382.0208 1393.3701 1427.7924 1443.7808 1457.3521 1461.8845 1471.4129 1476.5360 1832.5403 2954.7648 2958.7414 3026.1196 3028.8644 3059.5192 3065.2415 3082.3094 3085.2141 3148.6666 3164.0869
redmass: 1.0434 1.2435 2.9179 1.9638 1.8369 2.3322 2.5124 3.3565 3.5968 1.0309 1.1308 3.5692 1.3960 1.2428 1.9787 5.2033 1.1809 1.4906 1.5050 1.5873 1.2653 2.6663 4.3428 1.2583 1.2216 1.0848 1.1541 1.0506 1.0456 1.0449 1.0831 9.7676 1.0372 1.0371 1.0972 1.0965 1.0503 1.0605 1.0981 1.0980 1.1152 1.1137
irintensity: 0.0000 4.1842 0.0267 0.0000 3.5538 0.1579 1.3501 3.8548 4.3075 5.5843 0.0000 7.2649 2.9264 0.0000 3.3820 25.6598 7.4554 1.2191 6.3730 2.9867 0.0000 29.6805 2.9921 23.5240 3.3741 6.5577 4.8541 0.0000 8.7158 25.1252 4.5318 4.6670 26.6827 66.2205 0.0004 61.5322 22.6268 31.6140 26.3847 31.7335 0.0000 34.2152
temp: 298.150 k
press: 1.00000 atm
elementType: 6 6 6 6 6 6 1 1 1 1 1 1 1 1 1 1
symmnumber: 1
zpe: 364376.1 jmol-1
zpe.correction: 0.138784 hartree
zpe.thermalcorrener: 0.146188 hartree
zpe.thermalcorrenthalpy: 0.147132 hartree
zpe.thermalcorrgfe: 0.108068 hartree
zpe.sumelectzpe: -234.096016 hartree
zpe.sumelectthermal: -234.088611 hartree
zpe.sumelectthermalent: -234.087667 hartree
zpe.sumelectthermalfe: -234.126731 hartree
dipole: 0.2572 0.0000 0.0002
dipole: 0.2572
quadrupole: -36.6005 -37.1349 -37.6286
quadrupole: 0.0000 0.0003 0.0000
quadrupole: 0.5208 -0.0136 -0.5073 0.0000 0.0003 0.0000
hfenergy: -234.2347992 hartree
pointgroup: C01 [X(C6H10)]
dipole: -0.1011841 0.0000097 0.0000801 debye
dipolederiv: -0.023241 -0.1029744 -0.0000403 -0.089844 -0.2093232 -0.0000035 -0.0000592 -0.0000219 0.1939338 -0.0232435 0.102955 -0.000022 0.0898309 -0.2093492 -0.0000062 -0.0000413 0.0000154 0.1939324 -0.1319812 0.0000172 0.0000196 0.0000115 0.2503951 0.0000066 0.0000964 0.0000042 -0.2255634 0.3061279 -0.0000019 -0.0000356 0.0000008 0.2623643 -0.0000007 -0.0000833 -0.000001 -0.1062867 -0.0558543 -0.0622338 0.0000012 0.0074819 -0.1149794 0.0000024 0.0000279 0.0000148 0.1070616 -0.0558477 0.0622277 0. -0.0074901 -0.1149882 -0.0000053 0.0000169 -0.0000138 0.1070633 0.0289717 -0.070986 0.0252237 -0.0828901 0.0099896 0.073237 0.0836215 0.0879111 -0.052555 0.0289806 -0.0709635 -0.0251769 -0.0828483 0.0099888 -0.0732535 -0.0835995 -0.08793 -0.0525832 0.0289929 0.0709667 -0.0251745 0.0828493 0.0099719 0.0732544 -0.083591 0.0879361 -0.0525725 0.0289935 0.0709805 0.0252094 0.0828859 0.0099824 -0.0732339 0.0836072 -0.0879163 -0.0525655 -0.044878 -0.0425804 0.1188911 -0.0518325 0.0676574 -0.0201102 0.1627507 0.0300835 -0.0656761 -0.0449254 -0.0425798 -0.1189078 -0.0518108 0.0676653 0.0201212 -0.1627592 -0.0300737 -0.0656431 0.0238573 0.1460205 0.0000146 0.0706152 -0.0873502 -0.0000105 0.000008 -0.0000124 0.1013883 -0.0449073 0.0425951 -0.1189048 0.0518295 0.0676548 -0.0201031 -0.1627519 0.0300952 -0.0656517 -0.0448823 0.0425877 0.1188982 0.0518366 0.0676507 0.020105 0.162754 -0.0300918 -0.0656702 0.0238369 -0.1460306 0.0000039 -0.0706257 -0.0873301 0.0000004 0.0000027 0.0000009 0.101388 unknown
polarizability: 87.5540244|-0.0011038|62.8296568|-0.0003251|0.0001137|46.0761445 unknown
InChI: InChI=1S/C6H10/c1-5(2)6-3-4-6/h3-4H2,1-2H3
charge 0 multiplicity 1
16 atoms
C  1.76746 0.789049 -0.000006
C  1.767387 -0.789192 -0.000019
C  0.501173 -0.000005 -0.000152
C  -0.846241 0.000048 -0.000125
C  -1.644332 -1.293267 -0.000074
C  -1.644219 1.293435 -0.000062
H  2.090835 1.292024 -0.919858
H  2.090576 1.29201 0.919944
H  2.090487 -1.292206 0.919907
H  2.090674 -1.29216 -0.919904
H  -2.3040 -1.353019 0.889041
H  -2.304139 -1.352961 -0.889092
H  -0.981574 -2.175783 -0.000155
H  -2.303983 1.353223 -0.889104
H  -2.30392 1.353217 0.889032
H  -0.981383 2.175889 -0.000073
