program: Gaussian 09
title: 000138333
version: EM64L-G09RevD.01
frameworkgroup: C1[X(C8H4O3)]
method: RPBEPBE
basis: SDD
operation: Freq
keyword: #p
keyword: freq=noraman
keyword: PBEPBE/SDD
title: #p freq=noraman PBEPBE/SDD
converged: NO NO NO NO
title: Mulliken charges:
elementType: O O O C C C C C C C C H H H H
charge: -0.240141 -0.132187 -0.105854 0.180536 0.237737 -0.011684 -0.318713 -0.322186 0.089269 -0.233333 -0.176585 0.274032 0.270819 0.244473 0.243817
chargesum: 0.00000
title: Mulliken charges with hydrogens summed into heavy atoms:
elementType: O O O C C C C C C C C
charge: -0.240141 -0.132187 -0.105854 0.180536 0.237737 -0.011684 -0.044681 -0.051367 0.089269 0.011140 0.067232
polarizability: 1.42295509e+02 -6.27746407e+00 9.71104896e+01 1.33425284e-02 -4.47894026e-03 3.58759238e+01
1716.lowfreq: -9.8869 0.0005 0.0006 0.0007 9.5416 11.3443 105.1132 138.3062 258.7847
frequency: 105.0993 138.3054 258.7845 264.2960 305.4648 385.1326 451.6041 466.6673 523.2645 533.5107 603.0696 630.2145 693.1770 703.3969 763.8799 799.4522 825.2197 869.3985 882.8609 965.6337 969.6133 996.7555 1012.2483 1091.2891 1159.8899 1174.9027 1210.2281 1291.9495 1397.7503 1444.0104 1460.5043 1598.5964 1620.5482 1652.2610 1734.9584 3145.2762 3156.5618 3174.5990 3186.9229
redmass: 8.5566 6.0395 6.9103 6.6346 13.6915 4.6359 4.7113 8.7817 3.7883 8.1175 10.8531 9.6628 7.1631 4.7731 1.5504 3.2931 9.2572 8.6027 1.4177 1.3941 9.4784 1.3441 2.0373 2.2468 1.5022 1.9102 2.2526 1.5622 8.5088 2.4299 2.6506 7.3939 8.0845 12.5165 12.8704 1.0871 1.0915 1.0974 1.0979
irintensity: 0.1470 0.1763 1.9917 0.1262 3.5270 3.4407 27.3626 2.6914 0.2714 2.7396 1.2841 11.4087 0.1651 0.6060 78.6767 19.3521 96.5934 26.5014 0.7513 3.1382 148.0337 0.1754 0.1166 17.2560 19.1812 24.4036 6.0009 50.2369 20.1853 84.8931 20.0306 21.1860 345.2361 174.3048 153.7532 2.4934 3.4854 13.1946 3.7882
temp: 298.150 k
press: 1.00000 atm
elementType: 8 8 8 6 6 6 6 6 6 6 6 1 1 1 1
symmnumber: 1
zpe: 261068.8 jmol-1
zpe.correction: 0.099436 hartree
zpe.thermalcorrener: 0.107420 hartree
zpe.thermalcorrenthalpy: 0.108365 hartree
zpe.thermalcorrgfe: 0.066378 hartree
zpe.sumelectzpe: -532.155195 hartree
zpe.sumelectthermal: -532.147211 hartree
zpe.sumelectthermalent: -532.146267 hartree
zpe.sumelectthermalfe: -532.188254 hartree
dipole: 6.3786 -0.2988 0.0022
dipole: 6.3855
quadrupole: -64.6155 -63.2071 -62.3602
quadrupole: 0.3116 -0.0064 0.0001
quadrupole: -1.2212 0.1871 1.0341 0.3116 -0.0064 0.0001
hfenergy: -532.2546313 hartree
pointgroup: C01 [X(C8H4O3)]
dipole: 2.5095367 0.1170813 -0.0008621 debye
dipolederiv: -1.6126407 0.2016893 0.0003742 -0.2521978 -0.432516 0.000154 0.0003111 -0.0001253 -0.1783895 -0.6864416 -0.2290652 -0.0000529 -0.4713166 -0.7446687 -0.000087 0.0003089 0.000304 -0.2799647 -1.1263672 0.1082021 0.0001469 0.2304046 -0.3781502 -0.000057 0.0006651 -0.0001224 -0.2708508 -0.9518199 -0.3462118 0.0000811 0.1555729 -0.2729428 -0.0000228 0.0000035 0.0000486 -0.0292169 1.2151558 -0.3909568 -0.000203 -0.2330185 0.3146271 0.0001294 -0.0003955 0.0000546 0.0890536 1.2990493 0.4650549 0.0000215 0.3815074 0.7511232 -0.0000441 -0.0002248 -0.0003584 0.2116544 0.2988366 0.2544844 0.0000026 -0.1412122 0.1264137 -0.0000118 0.0000452 0.0000302 -0.0693845 -0.6426358 0.1972265 0.0000628 0.0665023 0.0819878 -0.000002 0.0000294 0. -0.157288 1.8781271 0.0598588 -0.0004574 0.5018196 0.5147073 -0.0000621 -0.0007425 0.0002039 0.2924852 -0.0345198 -0.2501781 0.0000272 -0.2061054 -0.2889087 -0.0000216 0.0000169 -0.0000156 -0.1738562 0.2651899 -0.0570993 0.0000029 -0.0537315 0.2623115 0.0000021 -0.0000008 -0.0000195 -0.1045057 0.0944082 -0.0280896 -0.0000041 0.0117523 -0.018096 0.0000078 -0.0000252 -0.0000057 0.1581888 0.1045973 0.0059089 0.0000005 -0.0111065 -0.0203508 0.0000009 0.000032 -0.0000233 0.1852462 -0.0438124 0.0776457 -0.0000033 0.087641 0.0361931 0.0000156 0.0000033 0.0000186 0.1708813 -0.0571268 -0.06847 0.0000011 -0.0665116 0.0682694 -0.0000013 -0.0000265 0.0000103 0.1559469 unknown
polarizability: 142.2978014|6.2692086|97.1081974|-0.0133433|-0.0044765|35.8759238 unknown
InChI: InChI=1S/C8H4O3/c9-7-5-3-1-2-4-6(5)11-8(7)10/h1-4H
charge 0 multiplicity 1
15 atoms
O  -0.892772 1.511589 -0.000163
O  -1.840156 -1.992347 0.000356
O  -3.128767 0.798797 0.000856
C  0.208847 -0.593918 -0.000367
C  0.356227 0.817409 -0.000399
C  -1.22529 -0.901008 -0.000437
C  1.351809 -1.424505 -0.000172
C  1.60066 1.451522 -0.000376
C  -1.935635 0.505654 -0.000088
C  2.623453 -0.81126 -0.000205
C  2.740397 0.605269 -0.000319
H  1.238623 -2.513434 -0.000103
H  1.686349 2.540869 -0.000349
H  3.528295 -1.426517 -0.000143
H  3.736562 1.06088 -0.000291
