program: Gaussian 09
title: 000138332
version: EM64L-G09RevD.01
frameworkgroup: C1[X(C8H17Br)]
method: RPBEPBE
basis: SDD
operation: Freq
keyword: #pfreq=noraman
keyword: PBEPBE/SDD
title: #p freq=noraman PBEPBE/SDD
converged: YES YES NO NO
title: Mulliken charges:
elementType: Br C C C C C C C C H H H H H H H H H H H H H H H H H
charge: -0.074484 -0.370212 -0.024776 -0.406701 -0.309973 -0.438352 -0.714077 -0.711756 -0.654347 0.194357 0.192943 0.191924 0.206789 0.203985 0.228357 0.220858 0.282783 0.205470 0.213296 0.218825 0.207076 0.213243 0.213506 0.227731 0.238754 0.244784
chargesum: 0.00000
title: Mulliken charges with hydrogens summed into heavy atoms:
elementType: Br C C C C C C C C
charge: -0.074484 0.017088 0.167149 0.004072 0.139241 -0.155569 -0.076487 -0.077932 0.056921
polarizability: 1.38923581e+02 9.59399806e+00 9.39629077e+01 -1.23003320e+00 -1.47395266e-01 8.08528887e+01
1716.lowfreq: -22.6825 -3.8013 -0.0003 0.0001 0.0004 3.2071 27.2395 45.2205 72.8544
frequency: 26.5999 44.7984 72.8459 110.0567 124.0109 161.9537 206.2183 223.2568 228.6184 247.9245 280.5229 320.7812 370.1047 404.7883 441.3256 446.9093 585.8182 737.8842 807.1761 825.1801 889.3351 911.2422 934.3395 949.4314 963.9001 996.7689 1015.9846 1034.5265 1061.9600 1116.3671 1143.7958 1153.7600 1176.2271 1185.2755 1217.6762 1248.3377 1268.8492 1291.7362 1300.6279 1327.6667 1332.0400 1339.6807 1347.4559 1375.7448 1391.2178 1393.0074 1455.0203 1458.6265 1461.6914 1468.2391 1472.3017 1474.6427 1480.6589 1482.4438 1489.3596 2948.3650 2954.8952 2965.8859 2969.3786 2970.5136 2980.3671 2991.8257 3001.1301 3028.3060 3047.6630 3058.2300 3064.5074 3066.6187 3068.0788 3071.6831 3075.8209 3106.3916
redmass: 2.7826 3.1903 3.9493 1.7518 2.2143 4.9982 1.1388 1.6416 1.2462 1.2761 2.8535 2.7791 2.2443 2.1327 2.6431 2.3182 3.2917 1.1362 2.3349 1.4584 2.2012 1.1927 1.7133 1.3362 1.4427 1.5321 3.0112 1.4183 2.4284 1.8992 2.3612 1.7475 1.7456 1.6290 1.4457 1.2635 1.2454 1.0969 1.3031 1.4184 1.3870 1.4483 1.5119 1.2183 1.2208 1.2150 1.0636 1.0733 1.0504 1.0450 1.0582 1.0619 1.0876 1.0591 1.0512 1.0709 1.0701 1.0359 1.0523 1.0420 1.0388 1.0599 1.0993 1.1022 1.0930 1.0994 1.0993 1.0995 1.0994 1.0987 1.0944 1.1005
irintensity: 0.3768 0.2156 0.6675 0.0104 0.1373 1.3892 0.1437 0.2032 0.8088 0.3617 5.1491 1.1165 1.2862 0.5116 7.0089 2.1688 27.7100 6.5655 1.0218 0.8444 9.4541 3.9185 10.3696 1.5087 1.0970 13.1973 5.1192 1.6672 6.1056 2.8416 6.4888 51.2923 7.9380 6.5813 10.2733 23.8131 7.3619 0.5901 12.2888 3.5428 1.8317 3.2224 1.0354 20.5371 32.1049 6.4879 0.7347 2.7995 8.0303 2.6849 3.1017 5.8209 12.7735 7.4227 27.1755 7.3969 24.6654 35.0837 33.9123 29.2992 23.3349 27.4446 5.7771 27.1558 14.3697 9.4272 4.4643 113.4500 46.4851 73.7636 35.0128 28.2084
temp: 298.150 k
press: 1.00000 atm
elementType: 35 6 6 6 6 6 6 6 6 1 1 1 1 1 1 1 1 1 1 1 1 1 1 1 1 1
symmnumber: 1
zpe: 607980.3 jmol-1
zpe.correction: 0.231567 hartree
zpe.thermalcorrener: 0.244119 hartree
zpe.thermalcorrenthalpy: 0.245063 hartree
zpe.thermalcorrgfe: 0.190813 hartree
zpe.sumelectzpe: -327.752270 hartree
zpe.sumelectthermal: -327.739719 hartree
zpe.sumelectthermalent: -327.738775 hartree
zpe.sumelectthermalfe: -327.793025 hartree
dipole: 2.7848 1.4419 -0.2439
dipole: 3.1454
quadrupole: -76.8248 -67.2523 -67.8834
quadrupole: -2.4317 0.4565 -0.2711
quadrupole: -6.1713 3.4012 2.7701 -2.4317 0.4565 -0.2711
hfenergy: -327.983838 hartree
pointgroup: C01 [X(C8H17Br1)]
dipole: 1.0318513 0.6406554 -0.2372039 debye
dipolederiv: -0.6661967 -0.207325 0.1093811 -0.2802132 -0.369567 0.1011026 0.0803999 0.0605926 -0.209308 -0.0260215 -0.0132725 0.0192157 -0.1396848 0.0472889 -0.0119188 0.0085343 -0.013989 0.1498754 0.1079196 0.0032947 -0.0004302 0.1054377 0.1431644 -0.0169261 -0.0030221 -0.0151832 0.1588548 -0.1023186 0.0061962 0.0299698 0.1885821 0.1006274 -0.0213289 0.0691341 -0.0011819 0.1817239 -0.2156103 -0.0030283 0.0350169 -0.1502662 -0.0371943 0.0481849 -0.0176646 0.0076396 0.1146032 0.8907454 0.3597132 -0.1409523 0.3763146 0.5017847 -0.1545639 -0.1384679 -0.116959 0.2065537 0.0039163 -0.0108781 -0.0093298 -0.0414642 -0.0071497 -0.1028649 0.0013016 -0.0833599 -0.0060881 -0.0771849 0.0572718 0.0169231 0.0029629 0.0147153 -0.0339021 0.0259146 -0.0517164 0.0713978 -0.1202239 -0.0783822 0.0402729 0.0157041 -0.1310656 0.146674 -0.0334264 0.0814209 -0.0258227 0.0305279 -0.0325214 -0.0288605 -0.0147366 -0.0526926 -0.1204663 -0.0231211 -0.1388509 -0.0813485 0.0231251 0.013645 -0.0116794 0.0276592 -0.0189552 0.0990108 -0.0041126 0.1360321 -0.0915845 0.0299958 0.0353539 -0.0393617 0.0055345 -0.0605057 0.1074937 -0.0283492 0.1061406 -0.1313668 0.0846573 0.0093281 0.0075067 -0.0034991 -0.0367605 -0.1043691 -0.0076884 -0.1225788 -0.084034 0.057162 -0.0071985 0.0032978 -0.0027471 -0.0518731 0.1098609 -0.0125769 0.1252777 -0.0715695 0.0583617 0.0286843 -0.031066 0.0350602 -0.0288875 0.0933229 -0.0169538 0.1105003 -0.0372638 0.0433896 -0.0149302 -0.0132673 -0.0034981 0.0185604 -0.0831186 -0.0042309 -0.1051877 -0.0804517 -0.0431267 -0.0801438 -0.0325131 -0.0407448 -0.0515296 -0.052978 0.0077842 -0.0398462 -0.0813698 0.0974137 -0.0035167 -0.0025809 0.0210988 -0.0135786 0.148309 -0.0234628 0.0742173 -0.0947046 -0.1579744 -0.1472182 -0.0072661 -0.1171912 0.0285842 -0.004808 0.0270008 0.0135945 0.0729093 -0.0280611 0.164373 0.0472741 0.1566946 -0.0383759 -0.045937 0.0408898 -0.0358096 0.0517891 0.0802916 0.0063021 0.0166371 0.048633 -0.0143899 0.0972759 -0.0415606 0.1475206 -0.0800606 -0.186625 -0.0769791 0.039561 -0.1220102 0.017988 0.0237385 0.0295199 0.0105643 0.0923661 0.084921 -0.0243522 -0.0584957 0.0098445 -0.0183356 -0.1295027 -0.0143671 -0.1384974 -0.0929584 -0.0086934 -0.1335013 0.0092777 -0.1667254 -0.0213452 0.0361382 0.0485959 0.0607396 0.0562322 0.1142256 0.0169294 -0.0007235 -0.0110002 0.0348988 -0.1211963 -0.0066116 -0.0546697 -0.0720921 -0.0746163 0.132156 0.0021924 0.1002549 0.0445939 -0.0072305 0.0365409 -0.0164102 0.0837177 unknown
polarizability: 136.5170947|13.2117805|95.5909049|-4.696163|-3.2945226|81.631378 unknown
InChI: InChI=1S/C8H17Br/c1-7(2)5-4-6-8(3)9/h7-8H,4-6H2,1-3H3
charge 0 multiplicity 1
26 atoms
Br -4.129007 -0.997099 0.467079
C  1.305259 -0.624724 -0.077297
C  2.641982 0.151115 -0.226579
C  0.045134 0.269629 -0.006948
C  -1.255594 -0.577559 0.02049
C  -2.515041 0.278686 0.221895
C  2.94329 1.04076 1.003927
C  3.808778 -0.833461 -0.479651
C  -2.847071 1.242247 -0.920213
H  1.199486 -1.31909 -0.937023
H  1.357411 -1.259749 0.832394
H  2.551562 0.812081 -1.115875
H  0.085452 0.908443 0.898177
H  0.037533 0.951702 -0.880572
H  -1.184761 -1.31631 0.841208
H  -1.349556 -1.151916 -0.921645
H  -2.4917 0.798009 1.195593
H  3.010401 0.423951 1.921446
H  3.907943 1.56766 0.88168
H  2.1636 1.806972 1.165865
H  3.934265 -1.520113 0.37999
H  4.763916 -0.294376 -0.621678
H  3.627567 -1.449295 -1.380506
H  -2.039779 1.994223 -1.017719
H  -2.936318 0.701912 -1.878774
H  -3.791752 1.778902 -0.732662
