program: Gaussian 09
title: 000138331
version: EM64L-G09RevD.01
frameworkgroup: C1[X(C7H8O)]
method: RPBEPBE
basis: SDD
operation: Freq
keyword: #p
keyword: freq=noraman
keyword: PBEPBE/SDD
title: #p freq=noraman PBEPBE/SDD
converged: NO NO NO NO
title: Mulliken charges:
elementType: O C C C C C C C H H H H H H H H
charge: -0.240922 -0.254151 -0.506675 -0.151299 -0.182084 -0.203154 -0.244834 -0.115265 0.240594 0.231101 0.248290 0.246608 0.234649 0.237592 0.230443 0.229107
chargesum: 0.00000
title: Mulliken charges with hydrogens summed into heavy atoms:
elementType: O C C C C C C C
charge: -0.240922 -0.013557 -0.027284 0.095309 0.052565 0.034438 -0.014391 0.113842
polarizability: 6.94957839e+01 -3.65319437e-01 7.66884181e+01 -6.77744666e-01 2.14591603e-02 5.62176519e+01
1716.lowfreq: -4.7127 -0.0007 -0.0006 0.0008 19.9336 30.8816 269.0960 296.2263 417.1486
frequency: 269.0812 296.2172 417.1437 425.2713 548.0486 564.8009 656.3867 706.7840 727.2588 758.1819 790.5253 859.3690 874.4519 893.2928 903.0742 922.5864 931.8506 977.9293 1006.2479 1026.6234 1041.2434 1096.9629 1139.2110 1186.7727 1208.1891 1251.1866 1267.7561 1285.9526 1301.0539 1319.6088 1351.2442 1453.8690 1579.2073 1606.3515 3028.5294 3071.7315 3103.9001 3107.5236 3149.7083 3153.6459 3183.1705 3186.5968
redmass: 3.3226 3.1169 3.9287 2.1126 3.3207 3.9449 4.1041 1.4097 2.4080 2.1881 5.0767 3.1014 3.0038 1.7096 1.4874 2.5877 1.4686 2.3302 1.9988 1.7720 1.9072 1.2155 1.1109 1.8326 1.4401 1.5653 1.4230 1.4880 1.2901 1.6549 1.3969 1.0966 5.9392 6.0658 1.0596 1.0884 1.1060 1.0910 1.0880 1.0869 1.1034 1.1067
irintensity: 9.6026 4.4804 4.4437 2.2060 16.9564 8.0871 2.9982 56.2995 8.4449 74.3189 12.9959 6.5972 6.1222 4.7605 6.6213 17.3552 2.1983 27.2629 21.8695 10.1259 23.7077 5.7211 3.3397 22.6990 11.7178 1.1975 2.3623 1.1174 2.5252 21.9029 5.1274 9.8444 3.1926 43.1089 23.7847 38.7361 20.7366 34.6731 6.0809 5.0119 32.0053 11.9132
temp: 298.150 k
press: 1.00000 atm
elementType: 8 6 6 6 6 6 6 6 1 1 1 1 1 1 1 1
symmnumber: 1
zpe: 344695.2 jmol-1
zpe.correction: 0.131287 hartree
zpe.thermalcorrener: 0.137102 hartree
zpe.thermalcorrenthalpy: 0.138047 hartree
zpe.thermalcorrgfe: 0.101898 hartree
zpe.sumelectzpe: -346.112688 hartree
zpe.sumelectthermal: -346.106873 hartree
zpe.sumelectthermalent: -346.105929 hartree
zpe.sumelectthermalfe: -346.142077 hartree
dipole: 0.9593 1.0840 0.3138
dipole: 1.4811
quadrupole: -46.9648 -45.4715 -46.4563
quadrupole: -2.3390 0.4110 -0.8975
quadrupole: -0.6673 0.8260 -0.1588 -2.3390 0.4110 -0.8975
hfenergy: -346.2439759 hartree
pointgroup: C01 [X(C7H8O1)]
dipole: 0.3934828 0.4093989 0.1308713 debye
dipolederiv: -0.6473192 0.2024755 -0.0869432 0.0506358 -0.8242377 0.0798233 -0.1029329 0.2096126 -0.4058701 0.0483447 0.1374046 0.0935817 0.0868344 0.1210813 0.0528879 -0.0016427 0.1678032 0.1260668 0.034576 -0.0094868 -0.0384761 -0.057229 -0.113742 -0.0779241 -0.0681392 -0.0202153 -0.0256331 0.5637581 -0.1128757 0.106774 -0.0161841 0.3281982 -0.0515251 0.0899918 -0.2587476 0.4129471 -0.05655 -0.1322632 -0.168324 -0.1400685 0.0990915 0.0012542 -0.1849768 -0.0988529 -0.0183666 -0.248382 0.0951396 -0.1444897 0.1488051 -0.1328611 0.060485 -0.10056 0.2199718 -0.1286781 -0.0985718 -0.1113348 0.10551 -0.0540436 -0.2596442 -0.0372489 0.1384103 -0.1691918 -0.3255971 0.2081447 -0.0953441 0.1481947 -0.1015603 0.7547001 -0.0867965 0.1989988 -0.0873532 0.0082684 0.0496202 -0.0630016 -0.035709 -0.0611211 -0.1184887 -0.0756281 -0.0331619 -0.0852578 0.0342859 -0.0861864 0.0264411 -0.1324571 0.0344854 0.0877589 0.0284284 -0.0933325 0.0197564 0.0092327 -0.0244046 0.0071563 0.1433309 -0.0011144 0.076021 -0.0152393 0.0938258 -0.0038424 -0.0368781 0.030896 -0.0071098 -0.0066575 0.0199368 -0.1226719 0.0815808 -0.0187406 0.0718324 0.0478229 0.1146748 -0.0320309 0.1000288 -0.0491981 0.0424627 0.0689738 0.1448643 0.0688151 -0.0004459 0.152997 0.0078177 0.0866478 0.038642 0.0308506 -0.0863016 0.1280281 -0.0965372 0.0093971 0.0270082 0.0725865 -0.0639612 0.0955815 -0.0459153 0.0530743 -0.0711263 0.0519669 0.1584402 -0.0686057 0.0144256 -0.1070503 0.0055981 0.0773965 0.0041558 -0.1195062 0.0102399 0.1350078 unknown
polarizability: 69.5113836|0.0152839|76.6953343|-0.0619461|-0.4899718|56.195136 unknown
InChI: InChI=1S/C7H8O/c1-2-7-5-6(1)3-4-8-7/h1-4,6-7H,5H2
charge 0 multiplicity 1
16 atoms
O  -1.125504 -1.157926 -0.127438
C  0.489704 1.171467 0.413498
C  0.457613 -0.017631 1.425593
C  0.2922 -1.184926 0.421681
C  1.355313 0.573124 -0.714856
C  1.241076 -0.788818 -0.706198
C  -0.921553 1.284567 -0.178553
C  -1.615839 0.131454 -0.412788
H  0.855535 2.123666 0.827508
H  1.418812 -0.120494 1.95762
H  -0.371533 0.049186 2.148804
H  0.390375 -2.202907 0.823975
H  1.860777 1.1780 -1.474969
H  1.617414 -1.486972 -1.458682
H  -1.361933 2.250113 -0.442597
H  -2.614058 0.074197 -0.856297
