program: Gaussian 09
title: 000138330
version: EM64L-G09RevD.01
frameworkgroup: C1[X(C6H4O)]
method: RPBEPBE
basis: SDD
operation: Freq
keyword: #p
keyword: freq=noraman
keyword: PBEPBE/SDD
title: #p freq=noraman PBEPBE/SDD
converged: YES YES YES YES
title: Mulliken charges:
elementType: O C C C C C C H H H H
charge: -0.078626 0.250711 -0.390205 -0.390205 -0.247711 -0.247710 0.104773 0.257896 0.257897 0.241590 0.241591
chargesum: 0.00000
title: Mulliken charges with hydrogens summed into heavy atoms:
elementType: O C C C C C C
charge: -0.078626 0.250711 -0.132308 -0.132308 -0.006122 -0.006119 0.104773
polarizability: 1.08737135e+02 3.78909934e-05 5.91581795e+01 1.00804563e-02 -6.63150940e-04 2.48999326e+01
1716.lowfreq: -17.8891 -8.6224 0.0005 0.0006 0.0009 3.5679 139.9821 150.4581 476.4052
frequency: 139.9821 150.4553 476.4052 542.1148 561.5702 591.0848 615.1827 703.2621 739.9169 823.2419 881.2857 887.9842 906.7380 1026.7995 1075.1099 1083.3169 1191.6170 1276.1153 1310.0586 1393.4462 1458.6042 1519.2050 2093.8603 3178.8916 3193.1247 3213.4769 3224.9571
redmass: 5.8184 5.9795 9.7290 8.3350 2.9032 3.3912 8.5720 1.2681 1.2730 5.8673 1.2853 3.4731 1.3706 2.2035 1.2697 1.0772 2.4428 1.7547 3.3778 3.7968 6.0259 4.8613 12.6256 1.0875 1.0920 1.1009 1.1092
irintensity: 0.2582 0.9473 2.7218 1.7494 0.0000 18.5666 4.2765 0.0000 164.3465 0.5667 0.0039 36.1796 0.0000 0.0249 17.7796 9.1066 0.2247 3.5102 1.7232 8.8271 75.5003 0.2654 978.6900 3.5538 2.5001 6.2347 6.2269
temp: 298.150 k
press: 1.00000 atm
elementType: 8 6 6 6 6 6 6 1 1 1 1
symmnumber: 1
zpe: 204907.2 jmol-1
zpe.correction: 0.078045 hartree
zpe.thermalcorrener: 0.083711 hartree
zpe.thermalcorrenthalpy: 0.084655 hartree
zpe.thermalcorrgfe: 0.048454 hartree
zpe.sumelectzpe: -305.722139 hartree
zpe.sumelectthermal: -305.716473 hartree
zpe.sumelectthermalent: -305.715529 hartree
zpe.sumelectthermalfe: -305.751730 hartree
dipole: 0.4311 0.0000 0.0000
dipole: 0.4311
quadrupole: -40.7394 -35.0139 -43.6331
quadrupole: 0.0002 0.0006 -0.0002
quadrupole: -0.9439 4.7816 -3.8376 0.0002 0.0006 -0.0002
hfenergy: -305.800184 hartree
pointgroup: C01 [X(C6H4O1)]
dipole: -0.1695972 0.000005 0.0000078 debye
dipolederiv: -1.9335212 -0.0001338 0.0002135 -0.0000564 -0.1549894 -0.0000003 0.0001126 -0.0000004 -0.1205754 -1.3698155 -0.0000894 0.0001895 -0.0001188 -0.0292421 0.0000003 0.0002051 0.0000013 -0.0343743 0.4901386 -0.1595288 -0.0001185 -0.331264 -0.0658211 0.0000585 -0.0001398 0.0000084 -0.2616514 0.4900603 0.1596173 -0.0001113 0.331362 -0.0657395 -0.0000504 -0.00013 -0.0000002 -0.2616562 -0.2730161 -0.0362134 0.0000178 -0.332855 0.0648724 0.0000635 0.000005 0.0000039 -0.1947614 -0.2730825 0.0361574 0.0000189 0.3327878 0.0649303 -0.0000529 0.0000185 0.0000069 -0.1947598 2.7880183 0.0001849 -0.0003022 0.0001359 0.1870523 -0.0000018 -0.0001783 -0.0000017 0.2485314 0.0664893 -0.0504933 0.0000193 -0.0105602 -0.0353078 -0.0000063 0.0000228 0.0000096 0.2140792 0.0664777 0.0505073 0.0000206 0.0105745 -0.0352985 -0.0000032 0.0000233 -0.0000205 0.2140797 -0.0258895 0.0953355 0.0000285 0.0778012 0.0347841 -0.0000171 0.0000305 -0.0000169 0.1955432 -0.0258594 -0.0953437 0.0000239 -0.077807 0.0347592 0.0000097 0.0000302 0.0000096 0.195545 unknown
polarizability: 108.7371349|0.0034035|59.1581798|-0.0100805|0.0006625|24.8999326 unknown
InChI: InChI=1S/C6H4O/c7-5-6-3-1-2-4-6/h1-4H
charge 0 multiplicity 1
11 atoms
O  2.870051 0.00019 -0.000288
C  0.324274 0.000041 -0.000059
C  -0.5453 1.194328 0.000153
C  -0.545115 -1.194377 0.000109
C  -1.854826 0.730898 0.000284
C  -1.854713 -0.731151 0.000248
C  1.669025 0.000158 -0.000212
H  -0.19047 2.224928 0.000141
H  -0.19013 -2.224924 0.000059
H  -2.745404 1.362602 0.000415
H  -2.745193 -1.362992 0.000349
