program: Gaussian 09
title: 000138329
version: EM64L-G09RevD.01
frameworkgroup: C1[X(C15H22)]
method: RPBEPBE
basis: SDD
operation: Freq
keyword: #p
keyword: freq=noraman
keyword: PBEPBE/SDD
title: #p freq=noraman PBEPBE/SDD
converged: YES YES NO NO
title: Mulliken charges:
elementType: C C C C C C C C C C C C C C C H H H H H H H H H H H H H H H H H H H H H H
charge: -0.378340 -0.381603 -0.380689 -0.400949 -0.363948 -0.369076 -0.367893 -0.481184 -0.485278 -0.483289 -0.494791 -0.035088 -0.020758 -0.034570 -0.024547 0.236514 0.189113 0.219802 0.190162 0.200284 0.207038 0.209941 0.195382 0.187241 0.242186 0.202933 0.199014 0.193663 0.206817 0.222361 0.228223 0.223698 0.236869 0.228797 0.224387 0.226999 0.230581
chargesum: 0.00000
title: Mulliken charges with hydrogens summed into heavy atoms:
elementType: C C C C C C C C C C C C C C C
charge: 0.047287 0.028361 0.026632 0.004374 0.065478 0.032870 0.032586 -0.030600 -0.024711 -0.030105 -0.037210 -0.035088 -0.020758 -0.034570 -0.024547
polarizability: 1.84759701e+02 2.10377094e+01 1.62418749e+02 -3.49092196e+00 -1.95606379e+00 1.16709231e+02
1716.lowfreq: -6.8382 -0.0006 0.0006 0.0006 7.0005 14.8662 35.0987 68.5994 74.9077
frequency: 34.5958 68.5686 74.8669 98.4986 116.7784 123.9451 131.8733 157.2179 164.7445 200.4251 208.2816 227.7297 255.7606 267.3628 315.7431 320.4513 348.9426 355.2521 366.8418 420.2587 483.7730 498.0850 550.8888 557.6433 668.0127 679.4402 728.4789 752.2872 782.2220 818.2676 834.8749 846.1729 856.0032 895.6879 896.5351 940.2647 957.3154 976.3966 1002.5405 1034.8995 1062.7564 1072.7980 1076.4653 1082.2127 1084.3468 1099.9338 1133.1667 1137.5590 1156.7972 1164.9658 1172.4768 1181.8453 1208.6920 1218.8508 1239.9517 1258.2542 1271.0954 1281.3624 1282.3015 1295.8464 1298.9067 1313.9974 1318.0336 1320.1337 1322.1309 1339.3558 1343.7142 1350.0366 1360.8018 1364.5542 1454.7934 1457.0303 1457.9935 1458.3250 1461.4403 1462.8691 1463.4477 1465.6926 1467.7423 1480.6969 1483.2126 2270.9615 2272.0459 2956.0432 2962.2821 2963.7135 2963.9291 2965.4614 2966.0558 2968.0654 2971.5738 2974.7067 2975.8276 2978.7372 3007.4642 3010.6740 3011.9344 3013.2765 3015.6621 3021.0666 3027.7179 3032.5878 3039.6823 3049.2905 3054.3936
redmass: 3.1913 4.2605 3.9720 3.2596 2.7882 2.1164 2.1842 2.3925 2.9514 2.5555 2.8956 2.2933 2.7561 2.8362 2.8946 2.8228 3.9822 3.4512 3.7191 2.9115 3.2068 3.0229 3.4327 3.4913 2.2228 2.1081 1.1881 1.3574 1.4074 1.7026 2.0369 1.8658 1.9540 1.7739 1.8345 2.0202 2.2156 1.9630 2.4114 2.0752 2.4193 2.5809 2.1643 2.1426 1.9312 2.3408 1.4296 1.3824 2.0173 1.8971 1.2906 1.1782 1.2616 1.2731 1.3386 1.3356 1.2194 1.2347 1.2360 1.0964 1.0895 1.3390 1.2737 1.4801 1.4307 1.4074 1.3662 1.4277 1.5581 1.5604 1.0733 1.0866 1.0840 1.0856 1.0791 1.0764 1.0866 1.0893 1.0754 1.0973 1.0958 11.6730 11.6875 1.0622 1.0601 1.0600 1.0604 1.0603 1.0592 1.0598 1.0613 1.0620 1.0624 1.0629 1.0948 1.0972 1.0995 1.0991 1.0991 1.0956 1.0998 1.1031 1.1023 1.1038 1.1038
irintensity: 0.0340 0.6423 1.0845 1.1160 0.2467 0.3000 0.5182 0.1585 2.0992 4.0416 5.5789 8.6393 2.7366 5.9182 3.5495 2.9982 0.2134 0.2772 0.0227 1.5680 7.5188 1.5345 0.1786 1.0964 0.5357 1.2488 19.1907 2.3148 1.1076 1.7750 1.0206 4.4080 1.5163 0.3996 1.7548 0.1395 1.3152 0.7868 1.7940 1.2811 0.2640 1.5055 0.8036 0.2912 2.3434 0.3464 0.1214 0.0506 0.0495 0.2730 2.3293 2.2082 1.4142 2.8943 0.6009 0.3467 2.8283 0.9914 0.8036 2.1773 3.3130 3.8049 3.7881 2.4752 14.0274 9.7096 0.9600 8.4078 0.4222 4.3283 3.2540 3.8886 7.4120 7.5980 1.5764 5.1973 0.4088 10.2236 21.4848 1.5816 16.0925 1.1793 0.4094 5.1054 4.3293 17.7189 30.6674 46.7621 22.2970 41.2865 12.5683 56.9175 124.7423 50.7162 6.9651 22.6974 5.3932 24.1336 35.7556 34.6885 32.5448 2.0017 29.5265 162.6613 87.7116
temp: 298.150 k
press: 1.00000 atm
elementType: 6 6 6 6 6 6 6 6 6 6 6 6 6 6 6 1 1 1 1 1 1 1 1 1 1 1 1 1 1 1 1 1 1 1 1 1 1
symmnumber: 1
zpe: 857828.1 jmol-1
zpe.correction: 0.326729 hartree
zpe.thermalcorrener: 0.343272 hartree
zpe.thermalcorrenthalpy: 0.344216 hartree
zpe.thermalcorrgfe: 0.282867 hartree
zpe.sumelectzpe: -583.520074 hartree
zpe.sumelectthermal: -583.503531 hartree
zpe.sumelectthermalent: -583.502587 hartree
zpe.sumelectthermalfe: -583.563936 hartree
dipole: 0.0502 -0.0411 0.2519
dipole: 0.2601
quadrupole: -84.7111 -90.9566 -92.4746
quadrupole: 7.5449 -1.3646 0.0754
quadrupole: 4.6696 -1.5758 -3.0938 7.5449 -1.3646 0.0754
hfenergy: -583.846803 hartree
pointgroup: C01 [X(C15H22)]
dipole: 0.0254047 -0.0033824 0.0990839 debye
polarizability: 160.4115728|19.8320805|186.7294508|-2.1581024|-3.7919356|116.746658 unknown
InChI: InChI=1S/C15H22/c1-2-4-6-8-10-12-14-15-13-11-9-7-5-3-1/h1-6,11-15H2
charge 0 multiplicity 1
37 atoms
C  0.75107 2.239097 -0.059588
C  1.941618 1.848269 0.847758
C  -0.416104 2.864589 0.737924
C  3.238007 1.48133 0.087211
C  -1.110827 -2.125921 -0.155631
C  -2.550995 -1.919855 0.361978
C  -0.214222 -2.896488 0.836549
C  -1.749347 2.935532 -0.065912
C  3.06746 0.372924 -0.994386
C  -3.364177 -0.904048 -0.496102
C  1.222739 -3.15752 0.293345
C  -2.347615 1.60252 -0.285136
C  2.466741 -0.881538 -0.499651
C  -2.824947 0.468774 -0.408741
C  1.924714 -1.925558 -0.120294
H  0.381651 1.339251 -0.58884
H  1.087514 2.955159 -0.839169
H  1.636967 0.990757 1.480373
H  2.168068 2.68621 1.539403
H  -0.139011 3.888892 1.059372
H  -0.592626 2.275867 1.659434
H  4.004946 1.155077 0.816254
H  3.637794 2.382981 -0.420442
H  -1.139538 -2.661608 -1.127733
H  -0.652068 -1.138728 -0.354059
H  -2.52167 -1.554071 1.407321
H  -3.092328 -2.887492 0.37337
H  -0.672246 -3.875446 1.086326
H  -0.144295 -2.322774 1.781832
H  -1.563778 3.432556 -1.03989
H  -2.473826 3.573815 0.478448
H  4.058484 0.157373 -1.441726
H  2.437127 0.764504 -1.817628
H  -4.421395 -0.904532 -0.163339
H  -3.367936 -1.239808 -1.553192
H  1.159929 -3.843974 -0.575886
H  1.81582 -3.685816 1.066346
