program: Gaussian 09
title: 000138328
version: EM64L-G09RevD.01
frameworkgroup: C1[X(C8H22SSi2)]
method: RPBEPBE
basis: SDD
operation: Freq
keyword: #p
keyword: freq=noraman
keyword: PBEPBE/SDD
title: #p freq=noraman PBEPBE/SDD
converged: YES YES NO NO
title: Mulliken charges:
elementType: S Si Si C C C C C C C C H H H H H H H H H H H H H H H H H H H H H H
charge: 0.138093 1.289158 1.289276 -0.983948 -0.984038 -1.006904 -1.010617 -1.007248 -1.010709 -1.006998 -1.007288 0.263109 0.261567 0.262965 0.261695 0.229491 0.250787 0.231399 0.235225 0.233530 0.233703 0.229739 0.231625 0.250375 0.233695 0.233565 0.235247 0.250319 0.231516 0.229717 0.231501 0.250918 0.229537
chargesum: 0.00000
title: Mulliken charges with hydrogens summed into heavy atoms:
elementType: S Si Si C C C C C C C C
charge: 0.138093 1.289158 1.289276 -0.459272 -0.459378 -0.295227 -0.308159 -0.295509 -0.308203 -0.295447 -0.295332
polarizability: 1.99694881e+02 6.35395808e-03 1.39297404e+02 6.35009942e-02 -6.66188028e-01 1.34461973e+02
1716.lowfreq: -22.1963 -19.7280 -8.3942 -0.0028 -0.0022 -0.0011 3.9691 17.5384 43.6827
frequency: -19.6239 14.6914 43.2041 51.5775 64.3991 97.8057 105.1082 109.2242 126.2583 126.3999 133.7446 135.2871 135.5167 167.7939 179.2587 183.6949 191.1647 214.2373 220.6585 221.0040 226.6008 269.2612 302.4455 554.1664 579.4597 627.5108 646.2244 687.6114 689.7317 690.0984 692.6258 714.0959 716.7451 727.8255 729.5219 740.1766 740.3962 805.7170 815.9232 838.3848 855.8917 903.4114 904.1587 906.5230 909.9109 917.0286 929.6624 1075.7246 1086.2170 1126.4906 1188.8412 1291.2941 1291.7503 1293.6671 1294.2184 1305.3489 1306.9037 1411.4902 1419.9062 1440.1621 1440.3449 1445.4026 1446.1962 1446.6007 1447.8258 1452.1766 1453.4194 1454.7103 1454.9172 1462.3923 1463.3920 2978.5577 2978.6052 2980.6366 2980.7086 2981.6666 2981.8009 2987.9853 2990.5570 3058.7426 3064.5756 3081.0828 3081.1067 3082.0746 3082.1910 3084.2433 3084.4162 3084.4613 3084.5436 3088.2052 3088.3349 3089.7867 3090.0374
redmass: 2.8295 4.6903 3.5505 3.1500 2.7533 1.3742 1.0694 1.6162 1.0787 1.0484 3.5327 1.0261 1.0301 3.0387 2.3245 2.3221 2.6545 2.5687 2.9390 2.4492 2.3423 3.2961 5.2292 4.1137 3.8203 4.7716 4.7565 3.0238 3.2625 3.0874 3.3244 1.3290 4.9160 3.4853 1.2545 1.1692 1.1689 1.3586 1.4257 1.3839 1.3816 1.5029 1.4933 1.5254 1.5823 1.5738 1.6069 1.0412 1.0518 1.1652 1.2695 1.2022 1.2023 1.2023 1.2026 1.1889 1.1892 1.0793 1.0747 1.0546 1.0546 1.0540 1.0540 1.0540 1.0541 1.0490 1.0490 1.0491 1.0491 1.0469 1.0469 1.0341 1.0342 1.0342 1.0342 1.0342 1.0342 1.0540 1.0553 1.1056 1.1062 1.0983 1.0983 1.0987 1.0987 1.0977 1.0976 1.0983 1.0982 1.0985 1.0985 1.0980 1.0980
irintensity: 0.0004 0.5265 0.1518 2.3566 0.0005 0.4463 0.1028 0.4267 0.0050 0.0107 0.0013 0.0002 0.0042 0.3698 0.0939 0.0021 0.2879 4.3281 5.5656 3.4576 0.0092 0.0827 8.4848 0.0023 0.0116 10.1064 0.1372 4.2403 14.2469 12.1119 13.7233 0.1955 14.1967 4.4156 1.5010 0.0335 0.0526 3.0567 25.3740 0.0027 19.4824 16.9599 30.7312 119.5858 207.3131 420.1004 50.7960 0.0005 17.8776 5.8067 2.2032 27.1661 58.4774 2.3237 95.3797 30.5397 11.6325 24.7779 1.3832 0.0035 0.0130 0.0996 0.2011 0.0393 0.0839 0.4174 27.9266 0.2883 18.5556 23.9482 8.9839 17.8147 16.6378 0.9365 35.0232 10.7605 12.2696 39.4171 8.5972 21.6497 0.0145 1.8593 2.1393 0.2235 1.3457 44.7278 51.4493 5.0374 49.3906 5.8063 10.0654 41.7571 14.1534
temp: 298.150 k
press: 1.00000 atm
elementType: 16 14 14 6 6 6 6 6 6 6 6 1 1 1 1 1 1 1 1 1 1 1 1 1 1 1 1 1 1 1 1 1 1
symmnumber: 1
zpe: 724613.1 jmol-1
zpe.correction: 0.275991 hartree
zpe.thermalcorrener: 0.295703 hartree
zpe.thermalcorrenthalpy: 0.296648 hartree
zpe.thermalcorrgfe: 0.226498 hartree
zpe.sumelectzpe: -1294.000892 hartree
zpe.sumelectthermal: -1293.981179 hartree
zpe.sumelectthermalent: -1293.980235 hartree
zpe.sumelectthermalfe: -1294.050384 hartree
dipole: -0.0003 1.3465 -0.1700
dipole: 1.3572
quadrupole: -88.5837 -93.9730 -95.4458
quadrupole: 0.0023 0.0062 -0.2976
quadrupole: 4.0838 -1.3055 -2.7783 0.0023 0.0062 -0.2976
hfenergy: -1294.2768822 hartree
pointgroup: C01 [X(C8H22S1Si2)]
dipole: -0.0026593 0.4868129 0.2193822 debye
polarizability: 199.6932222|0.2646122|138.5083476|0.1845138|1.9088093|135.2526889 unknown
InChI: InChI=1S/C8H22SSi2/c1-10(2,3)7-9-8-11(4,5)6/h7-8H2,1-6H3
charge 0 multiplicity 1
33 atoms
S  0.004578 -0.275293 -0.074708
Si 3.148388 0.010922 0.000944
Si -3.142086 -0.01905 -0.012388
C  1.454909 0.825215 0.445796
C  -1.45822 0.812995 0.436037
C  3.240934 -0.26011 -1.890141
C  4.52647 1.219134 0.564198
C  3.318578 -1.65651 0.923064
C  -4.533144 1.185596 0.525988
C  -3.306396 -1.67609 0.92944
C  -3.218665 -0.315287 -1.900409
H  1.38719 1.000281 1.536007
H  1.356101 1.797298 -0.073374
H  -1.397104 0.991149 1.526162
H  -1.366332 1.784851 -0.0848
H  4.194634 -0.74232 -2.174689
H  2.411761 -0.904897 -2.233287
H  3.16858 0.700351 -2.433116
H  5.525372 0.807592 0.326947
H  4.434546 2.196924 0.056208
H  4.483609 1.394772 1.654982
H  4.270666 -2.155223 0.66255
H  3.299237 -1.508792 2.018615
H  2.489373 -2.337678 0.659372
H  -4.500304 1.373792 1.615033
H  -4.44404 2.158274 0.007786
H  -5.527194 0.764295 0.285508
H  -2.470539 -2.354281 0.679308
H  -3.295018 -1.514675 2.023168
H  -4.25316 -2.184976 0.669264
H  -3.15817 0.639003 -2.455541
H  -2.37734 -0.951217 -2.230313
H  -4.162815 -0.816345 -2.184213
