program: Gaussian 09
title: 000138326
version: EM64L-G09RevD.01
frameworkgroup: C1[X(C12H12O)]
method: RPBEPBE
basis: SDD
operation: Freq
keyword: #pfreq=noraman
keyword: PBEPBE/SDD
title: #p freq=noraman PBEPBE/SDD
converged: YES YES NO NO
title: Mulliken charges:
elementType: O C C C C C C C C C C C C H H H H H H H H H H H H
charge: -0.418876 0.247714 0.300666 0.351703 0.377074 -0.109213 -0.671760 -0.388129 -0.375587 -0.849376 -0.795750 -0.259366 -0.274249 0.236691 0.246760 0.182406 0.228943 0.229074 0.239452 0.239680 0.212674 0.240141 0.227327 0.228483 0.353517
chargesum: 0.00000
title: Mulliken charges with hydrogens summed into heavy atoms:
elementType: O C C C C C C C C C C C C
charge: -0.065359 0.247714 0.300666 0.351703 0.377074 -0.109213 -0.435069 -0.141368 -0.193181 -0.151908 -0.103255 -0.032038 -0.045766
polarizability: 1.90813870e+02 -8.45660800e+00 1.56195251e+02 -3.68654829e-02 4.51395689e-03 6.19347462e+01
1716.lowfreq: -10.9625 -0.0007 0.0005 0.0007 6.6250 11.4720 66.8112 93.8773 108.4922
frequency: 66.7806 93.8681 108.4911 158.1327 188.3222 249.1863 260.5168 268.1865 276.2225 319.5454 361.7885 421.6638 428.0882 464.6124 502.8719 510.7983 563.5679 595.4525 630.4893 667.4617 703.0659 756.5672 778.4339 789.4337 863.1298 892.0463 919.4187 944.4874 983.4950 984.5038 1019.1979 1035.7037 1042.7859 1051.7077 1064.0240 1086.4621 1152.7505 1180.8079 1203.3379 1263.9879 1273.1820 1300.4563 1376.1712 1386.0715 1398.5501 1402.3239 1419.5932 1428.7021 1455.1440 1457.3138 1473.4403 1476.4048 1488.8225 1522.1716 1594.3493 1612.1042 1635.9403 2968.4776 2982.2127 3040.7916 3059.7701 3082.4278 3084.7821 3090.4214 3119.0169 3131.2143 3148.2516 3164.5873 3590.4584
redmass: 1.0275 3.0381 2.8658 3.2252 1.0722 3.1142 3.3176 1.4183 2.7735 4.1738 4.2827 5.7441 2.6409 6.3996 3.3156 5.5528 3.3530 3.0340 5.4018 3.7070 5.7074 1.4137 4.7378 2.3957 1.8723 1.3127 3.3258 1.3735 1.9353 1.3283 1.5126 2.9033 1.5078 1.5891 2.2740 3.9765 1.5159 1.0980 1.4778 1.4158 1.9390 3.3511 2.7259 3.0953 1.2887 1.3019 5.3232 2.9307 2.2134 1.0454 1.0460 1.1962 1.2128 3.6279 7.1329 5.6962 6.6059 1.0380 1.0365 1.0974 1.0968 1.0975 1.0880 1.1002 1.0914 1.0863 1.0929 1.0999 1.0653
irintensity: 1.0492 1.8016 5.2566 5.3316 0.4673 12.4665 0.5536 79.9011 1.2360 7.4174 0.2850 1.1676 25.1598 0.4600 0.4380 1.6843 8.1088 6.4124 3.5891 3.6480 15.5025 96.9111 1.6653 0.8208 0.4098 12.3483 2.2511 1.3514 0.0120 0.1326 34.0479 8.4939 0.0500 12.2243 3.7743 98.1541 69.4421 2.4885 58.6892 29.3039 8.4959 5.4089 63.5359 4.4234 13.3457 10.2885 12.4548 9.8627 14.3967 11.6929 14.3688 17.4574 13.1557 17.6735 12.0472 6.2264 1.1204 43.9061 34.2851 22.7934 17.4554 17.8293 21.5264 19.3512 25.3058 3.6890 25.5668 29.2533 20.6294
temp: 298.150 k
press: 1.00000 atm
elementType: 8 6 6 6 6 6 6 6 6 6 6 6 6 1 1 1 1 1 1 1 1 1 1 1 1
symmnumber: 1
zpe: 532425.2 jmol-1
zpe.correction: 0.202790 hartree
zpe.thermalcorrener: 0.214610 hartree
zpe.thermalcorrenthalpy: 0.215554 hartree
zpe.thermalcorrgfe: 0.165447 hartree
zpe.sumelectzpe: -538.791766 hartree
zpe.sumelectthermal: -538.779946 hartree
zpe.sumelectthermalent: -538.779002 hartree
zpe.sumelectthermalfe: -538.829110 hartree
dipole: 1.1718 -0.0173 -0.0042
dipole: 1.1719
quadrupole: -71.6914 -65.2554 -81.9696
quadrupole: -3.3812 -0.0009 0.0178
quadrupole: 1.2807 7.7168 -8.9975 -3.3812 -0.0009 0.0178
hfenergy: -538.9945565 hartree
pointgroup: C01 [X(C12H12O1)]
dipole: 0.459959 0.031858 -0.0032615 debye
dipolederiv: -0.2184011 -0.3000999 0.0026978 -0.4177803 -1.2639785 0.0141838 0.005177 0.0155778 -0.3882596 0.067057 -0.0280771 0.0003695 -0.3317244 -0.0957022 0.0024358 0.0045734 0.0016662 0.0089473 0.118928 -0.2506103 0.0033609 0.1472692 -0.2363773 0.0036423 -0.0018303 0.0048587 0.0327435 -0.2039309 0.0574507 -0.000459 0.0602668 0.254842 -0.0049261 -0.000566 -0.0056616 -0.0511873 0.3918968 0.2433562 -0.0053756 -0.0590692 -0.2521366 0.0034334 -0.0040986 0.0027772 -0.026783 -0.0957137 0.2304342 -0.0028676 0.4547739 1.136139 -0.0181833 -0.0066662 -0.0182956 -0.008348 0.0131295 -0.088628 0.0007172 0.035588 0.1122252 -0.0045306 -0.0004596 -0.0040206 -0.1945361 0.003709 0.0119704 -0.0006658 0.0725653 0.0578208 -0.0034117 -0.0013439 -0.0032652 -0.1542269 -0.0608196 0.0470248 -0.0011524 -0.0191873 0.0599402 -0.0036664 -0.0003676 -0.003872 -0.1816591 0.0440689 -0.070601 0.0011012 -0.0347667 -0.0536491 0.0021729 0.0005798 0.0030602 0.0820174 -0.0929141 -0.0929841 0.0023728 -0.1793644 0.0752475 -0.0005463 0.008178 -0.0015896 0.0636813 0.0340708 0.1105645 -0.0021072 0.071074 -0.0241372 -0.0023447 -0.0016205 -0.0024521 -0.173689 -0.0382045 -0.0897069 0.0010456 -0.0484788 0.075598 -0.0034599 0.0004597 -0.003472 -0.1639609 -0.0304196 0.1114827 -0.0013627 0.1144337 -0.0231813 0.0020557 -0.0014995 0.0021946 0.1418278 0.0780912 -0.0333514 0.0006723 -0.0813749 -0.0835311 0.003579 0.0013558 0.0034682 0.1428572 0.0515669 -0.1120287 0.0018833 -0.0466214 -0.1534583 0.0046892 0.0010077 0.0049781 0.1527672 0.0242279 -0.0988263 -0.1122633 -0.0289993 0.0021189 -0.0187916 -0.0951772 -0.0841897 -0.0464986 0.0264915 -0.0948063 0.1142253 -0.0261146 0.0044775 0.0176654 0.0952756 0.0835351 -0.0516752 -0.0772295 0.1807498 -0.001646 0.054403 0.0054311 0.0011366 0.0000063 0.0006496 0.1064667 0.0001423 -0.0103918 0.0173248 -0.0481977 0.0476623 0.1013444 0.0900026 0.0885286 -0.0435741 -0.018863 0.0582966 -0.0021464 0.1780542 -0.0737272 0.005758 -0.0057122 0.0051214 0.1032145 0.0033853 -0.0105341 -0.0152511 -0.0523896 0.0361869 -0.1059123 -0.0869762 -0.0922599 -0.0306943 -0.1323912 -0.0487408 0.0014501 -0.0571642 0.0718289 0.0014947 0.0016062 0.0014835 0.1632483 -0.0291294 0.1097326 -0.0011521 0.1209741 -0.0268806 0.0025328 -0.001366 0.0025701 0.16327 0.1412514 0.1683239 -0.0007715 0.1218305 0.3472409 -0.0003508 -0.0005382 -0.0013909 0.354051 unknown
polarizability: 191.9829311|-5.4489726|155.0053015|-0.2744637|-1.3620132|61.9556347 unknown
InChI: InChI=1S/C12H12O/c1-8-7-9(2)12(13)11-6-4-3-5-10(8)11/h3-7,13H,1-2H3
charge 0 multiplicity 1
25 atoms
O  -1.537068 -2.400259 0.060365
C  0.68771 0.680806 0.009522
C  0.313619 -0.722116 0.030895
C  -0.336946 1.695778 -0.00298
C  -2.085069 -0.079517 0.027045
C  -1.085978 -1.063528 0.039112
C  -1.677289 1.290061 0.005886
C  2.084782 1.009913 0.001161
C  1.348795 -1.715606 0.043073
C  0.019406 3.171589 -0.026248
C  -3.547762 -0.470178 0.036876
C  3.070694 0.020697 0.013289
C  2.698924 -1.358444 0.03451
H  -2.464396 2.054295 -0.003758
H  2.380239 2.063991 -0.015276
H  1.102266 -2.786658 0.059904
H  0.619154 3.466086 0.856565
H  0.609703 3.439903 -0.923715
H  -0.892189 3.792493 -0.030483
H  -3.797177 -1.058604 0.939219
H  -4.197249 0.421097 0.008815
H  -3.794118 -1.113318 -0.827921
H  4.130586 0.29742 0.006564
H  3.47292 -2.133314 0.044142
H  -0.781057 -3.036585 0.064439
