program: Gaussian 09
title: 000138322
version: EM64L-G09RevD.01
frameworkgroup: C1[X(C8H12O)]
method: RPBEPBE
basis: SDD
operation: Freq
keyword: #pfreq=noraman
keyword: PBEPBE/SDD
title: #p freq=noraman PBEPBE/SDD
converged: YES YES NO NO
title: Mulliken charges:
elementType: O C C C C C C C C H H H H H H H H H H H H
charge: -0.221227 0.306863 -0.534941 -0.482736 -0.719340 -0.733659 0.146281 -0.136438 -0.315043 0.242622 0.231086 0.227050 0.220890 0.207327 0.233525 0.217059 0.213903 0.220061 0.211039 0.212312 0.253365
chargesum: 0.00000
title: Mulliken charges with hydrogens summed into heavy atoms:
elementType: O C C C C C C C C
charge: -0.221227 0.306863 -0.061232 -0.034795 -0.061429 -0.088655 0.146281 0.075874 -0.061679
polarizability: 9.80321728e+01 8.79297594e+00 9.02037824e+01 -3.90739631e+00 3.71768729e-01 6.52881118e+01
1716.lowfreq: -15.1791 -5.4107 -0.0005 0.0006 0.0007 13.0783 88.6118 144.8097 205.2021
frequency: 88.5146 144.7957 205.1866 235.1304 273.1421 296.7952 314.7981 353.0081 384.0998 459.5904 469.3884 481.7166 573.2721 662.4965 739.2637 793.0177 846.2377 891.6299 899.5753 925.2666 936.6955 985.2962 988.3128 997.8371 1010.5427 1108.1374 1126.6095 1162.4524 1182.3464 1253.1571 1265.3596 1277.7455 1293.3053 1332.9167 1375.6953 1378.3709 1397.0725 1430.5413 1440.1934 1464.1972 1470.2847 1482.6332 1487.6706 1587.2085 1632.5395 2939.9968 2959.7659 2966.6163 2976.2644 3006.2223 3052.7244 3061.5047 3066.6505 3071.5908 3079.7919 3103.4787 3149.9463
redmass: 3.9450 2.6624 1.0336 1.4294 1.5318 2.7768 2.3247 2.4345 2.0193 3.9202 3.4314 4.1274 2.2626 5.2896 1.4144 2.8927 3.0348 2.5821 1.7201 2.0271 1.4263 1.8755 1.4939 1.5548 1.3852 1.4391 1.5454 1.2089 1.8097 1.8784 2.6467 1.7234 1.8865 1.8235 1.7790 1.2381 1.2051 1.0850 1.0862 1.0485 1.0581 1.0575 1.0600 9.3175 6.5546 1.0649 1.0638 1.0360 1.0365 1.0931 1.0951 1.0995 1.0996 1.0987 1.0992 1.0876 1.0973
irintensity: 3.5147 0.2747 0.0948 0.5606 0.3553 1.1835 0.1964 1.4681 0.5540 6.9119 2.0489 4.1412 6.6298 0.7977 29.7613 2.3218 2.4928 2.2740 13.0433 1.8567 1.5692 11.9116 2.0930 1.5026 0.6962 9.4200 3.6344 15.3420 0.0328 15.2996 28.8003 6.1961 11.8582 17.1443 30.2535 17.7364 14.9319 11.0508 10.0130 2.3329 10.2666 8.5646 13.8343 137.7836 76.5077 22.5229 18.4362 38.0124 19.9394 21.6566 8.0954 31.1815 15.1927 59.0402 34.0200 18.2125 18.7700
temp: 298.150 k
press: 1.00000 atm
elementType: 8 6 6 6 6 6 6 6 6 1 1 1 1 1 1 1 1 1 1 1 1
symmnumber: 1
zpe: 469765.1 jmol-1
zpe.correction: 0.178924 hartree
zpe.thermalcorrener: 0.188045 hartree
zpe.thermalcorrenthalpy: 0.188989 hartree
zpe.thermalcorrgfe: 0.145649 hartree
zpe.sumelectzpe: -386.562592 hartree
zpe.sumelectthermal: -386.553471 hartree
zpe.sumelectthermalent: -386.552527 hartree
zpe.sumelectthermalfe: -386.595866 hartree
dipole: 3.5541 2.5810 -0.4984
dipole: 4.4206
quadrupole: -63.1352 -53.9193 -54.8791
quadrupole: -6.3497 0.1170 0.4336
quadrupole: -5.8240 3.3919 2.4321 -6.3497 0.1170 0.4336
hfenergy: -386.7415158 hartree
pointgroup: C01 [X(C8H12O1)]
dipole: 1.4027979 -1.0009429 0.2345963 debye
dipolederiv: -0.8460764 0.2323178 -0.0689451 0.2917267 -0.7169152 0.0224994 -0.1109516 0.0117423 -0.3508184 0.1494382 0.0510145 -0.0197773 0.057408 0.0657856 -0.0171637 -0.0102582 -0.0253208 0.1399032 -0.3270771 -0.0850549 -0.1134361 -0.1142177 -0.0133974 -0.0528378 -0.161815 -0.0765443 0.0247944 -0.126533 -0.0483399 -0.0557655 -0.0585549 -0.0197046 -0.0050215 -0.1713403 0.0646859 0.1063152 0.022249 -0.0258251 -0.0044492 -0.043674 0.0473099 0.015899 -0.0081338 0.0153409 -0.0835077 -0.0360856 -0.0515765 -0.0384018 -0.0497535 0.0625788 -0.0114905 -0.0353732 -0.0089029 0.0397187 0.8998382 -0.0472571 0.1788993 -0.2932757 1.0978674 0.0192774 0.2296723 0.0988294 0.2043245 0.3609786 -0.1653486 0.063131 0.0213114 0.2050062 0.0389443 0.156349 -0.0311342 -0.1292213 -0.1162509 0.1176585 0.0223168 0.2579467 -0.5678086 0.0096375 0.0239315 -0.0137438 -0.184531 0.0473247 -0.0208964 0.0067172 -0.0198754 -0.1137132 0.0281401 0.0139581 0.0704277 0.0878442 0.049464 -0.0091135 -0.0018666 0.0002088 0.0883994 0.0320573 0.0328421 -0.0109834 -0.1254746 0.023513 0.0272515 -0.0378463 -0.0532058 0.0916088 0.0193708 -0.0430278 0.0704106 -0.1288652 -0.0565397 0.094675 0.0606066 0.0357393 -0.0014162 -0.0576977 0.110567 -0.0933899 0.0465421 -0.0799004 0.0885015 0.1056328 0.123579 0.0259043 -0.0585337 0.0543665 -0.0157014 0.0341825 -0.0604151 -0.056624 -0.1226012 -0.0470725 0.0562138 -0.0542588 -0.0906841 -0.0339248 0.025629 0.0871323 -0.018115 0.0152017 -0.0502509 -0.1452486 0.0829112 0.016831 0.0198272 0.0581304 -0.1003825 0.0669642 0.0347836 0.1420911 0.0119003 -0.0465177 0.0755346 -0.0566456 0.0570134 0.0620964 -0.0109589 -0.0089917 -0.0922847 -0.1466051 0.0380929 0.0061991 0.0696553 0.0763257 0.0716924 -0.0116884 0.0389983 -0.0022977 0.0812929 0.0367135 -0.0175227 0.0079824 -0.1865888 0.0336769 -0.0437034 -0.0085508 -0.0640013 -0.1397782 -0.0203179 -0.0169953 -0.0428682 0.1289971 -0.0581428 -0.0838812 -0.0456557 -0.0415469 0.0307197 -0.0197044 -0.0541494 -0.0197425 0.1592865 unknown
polarizability: 97.9989524|-8.6960835|90.0428868|4.7076577|0.052252|65.4822278 unknown
InChI: InChI=1S/C8H12O/c1-8(2)5-3-4-7(9)6-8/h3-4H,5-6H2,1-2H3
charge 0 multiplicity 1
21 atoms
O  -2.400576 1.27497 -0.111888
C  1.158041 0.210126 -0.00725
C  -0.052313 1.021242 0.544288
C  0.94187 -1.296743 0.331497
C  1.268283 0.402527 -1.543995
C  2.462437 0.709217 0.660919
C  -1.414405 0.50021 0.077501
C  -0.456767 -1.794975 0.035895
C  -1.537194 -0.967695 -0.092017
H  0.02458 2.089877 0.272762
H  -0.048633 0.969246 1.654679
H  1.152724 -1.464861 1.411328
H  1.681623 -1.915558 -0.21484
H  2.150407 -0.133936 -1.941075
H  0.373906 0.02761 -2.072762
H  1.382438 1.473901 -1.792437
H  3.334479 0.123351 0.31296
H  2.650315 1.770674 0.413534
H  2.410078 0.621286 1.762813
H  -0.591698 -2.880544 -0.074413
H  -2.537594 -1.351224 -0.3244
