program: Gaussian 09
title: 000138321
version: EM64L-G09RevD.01
frameworkgroup: C1[X(C12H20N4O2)]
method: RPBEPBE
basis: SDD
operation: Freq
keyword: #p
keyword: freq=noraman
keyword: PBEPBE/SDD
title: #p freq=noraman PBEPBE/SDD
converged: YES YES NO NO
title: Mulliken charges:
elementType: O O N N N N C C C C C C C C C C C C H H H H H H H H H H H H H H H H H H H H
charge: -0.433348 -0.433360 -0.071289 -0.071392 0.001471 0.001470 0.184486 0.184640 -0.413996 -0.414002 -0.411508 -0.411404 -0.695848 -0.695938 -0.328079 -0.328213 -0.196689 -0.196706 0.238949 0.213040 0.238952 0.213023 0.215365 0.232170 0.232179 0.215365 0.236914 0.237547 0.251480 0.251483 0.237535 0.236920 0.183018 0.222806 0.222831 0.183024 0.333549 0.333558
chargesum: 0.00000
title: Mulliken charges with hydrogens summed into heavy atoms:
elementType: O O N N N N C C C C C C C C C C C C
charge: -0.099800 -0.099802 -0.071289 -0.071392 0.001471 0.001470 0.184486 0.184640 0.037993 0.037972 0.036027 0.036140 0.030093 0.030000 0.077745 0.077642 -0.196689 -0.196706
polarizability: 1.67909401e+02 1.11559969e+01 1.70375178e+02 -8.62248641e+00 -8.77108052e+00 1.41908452e+02
1716.lowfreq: -14.6805 -8.8375 -8.2519 -7.3456 -0.0009 0.0002 0.0004 28.3245 40.9818
frequency: -8.8371 28.3245 40.8823 64.1567 67.7217 72.3306 80.5378 83.5796 93.6752 122.2647 126.7770 156.2137 158.6041 176.8045 191.4558 205.8496 215.5453 233.5801 240.0993 274.0214 291.2199 302.4433 313.9798 323.5780 333.2403 378.7770 413.1328 442.5604 461.5409 466.5290 467.6820 573.2359 583.3099 590.9008 611.9888 700.6240 725.9665 732.5928 788.5643 811.8144 838.6478 872.7880 884.0001 929.6164 946.0088 968.6555 969.0802 1006.7073 1014.5944 1039.8899 1042.2416 1060.8764 1061.4477 1090.7737 1101.1704 1104.3035 1108.3401 1155.6379 1159.4820 1203.9313 1214.5842 1255.3469 1256.5611 1287.4217 1288.0777 1300.6725 1302.4538 1326.3335 1326.7069 1358.3518 1358.5628 1383.4133 1384.6098 1387.3558 1387.4680 1437.8616 1438.9195 1457.2002 1461.3964 1465.4213 1465.5757 1468.5493 1472.2451 1472.7524 1483.1252 1483.1814 2193.6608 2193.9772 2946.3001 2946.3607 2979.1569 2979.2078 2994.3027 2994.3833 2999.6008 2999.6963 3045.0184 3045.0956 3061.5286 3061.6039 3079.0727 3079.1652 3106.8476 3106.8815 3111.8509 3112.0419 3560.0142 3560.0447
redmass: 5.8771 6.3361 6.4229 2.7274 1.9932 2.8793 4.9569 5.6144 5.4042 3.5850 2.9687 4.6870 3.5071 4.1449 2.7665 1.3168 1.0364 2.1819 2.4276 3.4082 2.8204 4.6588 1.6134 1.2715 2.0850 5.0901 5.7432 4.0866 4.2553 3.8934 4.9392 4.7513 5.2941 8.5444 5.2737 5.6160 1.5731 1.3250 1.5990 1.6627 7.2244 1.4268 1.5952 2.0562 2.1835 3.1977 2.8060 4.5182 3.5219 1.5606 1.7094 2.7629 2.7392 3.4399 3.3787 1.3909 1.3629 2.3230 1.9438 2.2577 2.6078 1.3220 1.3291 1.2298 1.2268 1.1485 1.1460 1.2872 1.2898 1.3631 1.3660 1.2066 1.1865 1.2382 1.2447 1.0736 1.0785 1.5475 1.0535 1.1599 1.0721 2.1772 1.0528 1.0520 1.0902 1.0900 12.6441 12.6422 1.0692 1.0692 1.0633 1.0633 1.0597 1.0596 1.0354 1.0353 1.0932 1.0931 1.0984 1.0983 1.1000 1.1001 1.1015 1.1015 1.1011 1.1011 1.0662 1.0662
irintensity: 1.4074 1.9339 0.0000 3.5919 0.0001 13.3355 0.0000 15.2518 0.0000 1.9687 0.0000 0.0000 1.9463 0.0000 3.3293 1.4457 0.0004 6.7864 0.0000 0.0001 20.6026 1.2428 0.0146 334.5178 0.0064 0.0000 0.0000 0.7930 16.2547 0.0001 7.8248 0.0000 0.0000 4.7054 7.2044 7.0086 0.0023 40.4685 0.0000 2.1147 0.0001 0.0001 3.1363 46.1961 0.0002 123.3905 0.0411 0.0006 37.5052 0.0000 4.3701 0.0423 33.1616 0.0001 15.2943 0.0011 36.7162 50.0912 0.0019 40.5901 0.0001 0.0619 47.9965 0.0036 9.9739 13.3449 0.0024 0.0742 3.4423 0.2730 13.6705 0.0018 3.7607 1.3148 65.5544 15.0647 0.0007 0.0000 32.8922 0.0128 3.2833 0.0005 0.0164 25.6950 1.4070 13.7694 5.8311 0.0001 52.2955 76.3520 8.1732 18.2984 11.4276 31.4087 30.6593 0.5093 15.3623 0.1872 13.0520 0.1785 3.6529 90.9386 15.6784 9.1091 1.0144 28.5112 12.0816 2.5238
temp: 298.150 k
press: 1.00000 atm
elementType: 8 8 7 7 7 7 6 6 6 6 6 6 6 6 6 6 6 6 1 1 1 1 1 1 1 1 1 1 1 1 1 1 1 1 1 1 1 1
symmnumber: 1
zpe: 810973.9 jmol-1
zpe.correction: 0.308884 hartree
zpe.thermalcorrener: 0.330233 hartree
zpe.thermalcorrenthalpy: 0.331177 hartree
zpe.thermalcorrgfe: 0.258050 hartree
zpe.sumelectzpe: -837.206345 hartree
zpe.sumelectthermal: -837.184996 hartree
zpe.sumelectthermalent: -837.184051 hartree
zpe.sumelectthermalfe: -837.257179 hartree
dipole: 0.0001 -0.0016 -0.0013
dipole: 0.0020
quadrupole: -114.8013 -133.7665 -108.8462
quadrupole: 12.5236 7.9205 18.3959
quadrupole: 4.3367 -14.6285 10.2918 12.5236 7.9205 18.3959
hfenergy: -837.5152285 hartree
pointgroup: C01 [X(C12H20N4O2)]
dipole: 0.0000061 -0.0005398 -0.0005982 debye
polarizability: 168.8276869|12.4280383|171.4160374|-6.9819523|-4.0178326|139.9493062 unknown
InChI: InChI=1S/C12H20N4O2/c1-11(9-13,5-3-7-17)15-16-12(2,10-14)6-4-8-18/h17-18H,3-8H2,1-2H3
charge 0 multiplicity 1
38 atoms
O  5.131734 -1.59952 -0.609596
O  -5.127199 1.612162 0.606357
N  0.008646 0.634286 -0.111871
N  -0.00428 -0.623696 0.112584
N  1.999771 3.256796 -1.070774
N  -1.99716 -3.244591 1.071821
C  1.152654 1.365959 0.621811
C  -1.148534 -1.355235 -0.621606
C  2.337323 0.465663 1.074803
C  -2.33229 -0.454383 -1.0755
C  3.182472 -0.128152 -0.072492
C  -3.178162 0.139901 0.071025
C  0.457103 2.043566 1.840439
C  -0.452355 -2.03359 -1.839378
C  4.333667 -0.997353 0.468138
C  -4.328575 1.009455 -0.470707
C  1.609477 2.411097 -0.326373
C  -1.606261 -2.399623 0.326904
H  1.905572 -0.354452 1.678582
H  2.979081 1.071755 1.743933
H  -1.899732 0.36555 -1.67895
H  -2.973799 -1.060164 -1.745175
H  3.601336 0.689565 -0.694219
H  2.554089 -0.754385 -0.731215
H  -2.550116 0.76602 0.730165
H  -3.597854 -0.677542 0.692542
H  1.152348 2.74772 2.327211
H  0.163014 1.266433 2.566858
H  -0.440918 2.598464 1.521987
H  0.445249 -2.588625 -1.519978
H  -0.157461 -1.25695 -2.5660
H  -1.147417 -2.737801 -2.326344
H  4.97675 -0.402408 1.154058
H  3.938134 -1.861742 1.028371
H  -3.932279 1.873579 -1.030805
H  -4.971381 0.414633 -1.156985
H  5.536718 -0.875834 -1.151701
H  -5.533963 0.888742 1.147479
