program: Gaussian 09
title: 000138320
version: EM64L-G09RevD.01
frameworkgroup: C1[X(C7H11NO)]
method: RPBEPBE
basis: SDD
operation: Freq
keyword: #p
keyword: freq=noraman
keyword: PBEPBE/SDD
title: #p freq=noraman PBEPBE/SDD
converged: YES YES NO NO
title: Mulliken charges:
elementType: O N C C C C C C C H H H H H H H H H H H
charge: -0.245159 -0.078316 -0.127570 -0.610132 -0.645593 -0.233790 -0.155224 -0.270796 -0.131663 0.233037 0.237328 0.231544 0.236737 0.231516 0.250641 0.246232 0.240841 0.203370 0.247764 0.139236
chargesum: 0.00000
title: Mulliken charges with hydrogens summed into heavy atoms:
elementType: O N C C C C C C C
charge: -0.245159 -0.078316 0.105467 0.095476 0.082795 0.007050 0.048145 -0.023031 0.007572
polarizability: 2.33046628e+02 5.88375677e+00 7.53589718e+01 -1.39344476e-01 8.87924704e-01 4.64400709e+01
1716.lowfreq: -4.3671 -0.0006 -0.0004 -0.0003 4.9082 18.7438 55.0527 72.8121 80.4264
frequency: 54.8487 72.8022 80.4217 124.3386 152.0967 176.2934 215.8997 252.8273 291.6996 324.5964 389.7757 420.4930 442.0316 568.6232 603.7998 821.6124 849.7532 870.8015 909.5308 954.9809 1000.4171 1059.9801 1091.9630 1093.5067 1129.6394 1152.4750 1190.8958 1197.4599 1258.4088 1272.4823 1290.8997 1349.0871 1375.7769 1394.9938 1434.8347 1450.3613 1462.2700 1470.9841 1490.0326 1494.0510 1575.1210 1619.7214 1654.1455 2825.3968 2956.6659 2963.1154 3036.2177 3039.3209 3056.3380 3096.7566 3105.3176 3120.0447 3126.0030 3133.8040
redmass: 2.0017 2.4934 4.4821 1.3590 1.3732 2.3865 3.6477 3.0419 4.3583 1.9037 3.6314 2.9132 2.8642 3.4234 4.1619 1.4649 3.8450 1.8556 1.1788 1.5929 1.1795 1.4839 1.5309 1.3947 1.3680 2.9227 1.7632 1.8047 1.7121 1.6837 1.5877 1.5906 1.5220 2.1781 1.1431 1.2215 1.0465 1.0419 1.0668 1.1352 5.6037 4.7876 5.2102 1.0831 1.0373 1.0389 1.0991 1.0984 1.0887 1.0986 1.0984 1.0935 1.0916 1.0875
irintensity: 1.5352 0.8719 2.3037 4.7385 2.2326 7.3911 2.1695 1.7119 2.3231 0.0546 6.4929 7.2802 0.6575 11.6597 19.1805 1.2333 20.2574 21.4753 5.4816 20.3354 94.3811 18.5761 71.7941 32.7624 26.9909 221.1385 9.2391 57.1058 32.6793 15.1346 4.2989 10.6585 169.4116 38.1725 25.6434 33.4198 28.0633 5.7586 14.4743 21.2336 505.0990 526.2462 485.2366 152.4118 60.8965 137.1906 37.8137 29.6549 17.8701 9.5579 25.4210 5.9930 4.8751 32.5128
temp: 298.150 k
press: 1.00000 atm
elementType: 8 7 6 6 6 6 6 6 6 1 1 1 1 1 1 1 1 1 1 1
symmnumber: 1
zpe: 433919.7 jmol-1
zpe.correction: 0.165271 hartree
zpe.thermalcorrener: 0.176066 hartree
zpe.thermalcorrenthalpy: 0.177010 hartree
zpe.thermalcorrgfe: 0.128329 hartree
zpe.sumelectzpe: -402.577397 hartree
zpe.sumelectthermal: -402.566602 hartree
zpe.sumelectthermalent: -402.565658 hartree
zpe.sumelectthermalfe: -402.614339 hartree
dipole: -10.3714 -0.9381 0.0411
dipole: 10.4138
quadrupole: -75.0798 -47.5015 -58.0024
quadrupole: -3.5435 -0.5492 0.1697
quadrupole: -14.8853 12.6931 2.1922 -3.5435 -0.5492 0.1697
hfenergy: -402.7426679 hartree
pointgroup: C01 [X(C7H11N1O1)]
dipole: 4.0824023 -0.3450342 -0.0365983 debye
dipolederiv: -1.7596833 0.0504662 0.0013448 0.3538309 -0.4740807 0.003566 -0.0140423 0.0044801 -0.3729475 -2.1875083 0.089214 0.0174595 -0.4941893 -0.4111849 0.0121928 -0.2569687 0.0056008 -0.2762469 2.3603874 0.0014927 0.0093279 -0.0666107 0.0966089 -0.0146032 0.0944097 -0.0243923 -0.0657066 0.7025745 -0.2099737 -0.0441663 -0.5330922 0.2023677 0.022797 0.0552356 0.0232334 0.267426 0.1593103 0.0460129 0.005232 0.5306477 0.380451 -0.0384071 0.0383648 -0.0222219 0.2573801 -1.6286578 -0.0276332 0.0058002 0.2849213 0.0189081 -0.0173646 0.0276946 -0.0171896 -0.297418 1.7726241 0.0322363 -0.00624 0.051141 0.1268266 -0.0108613 -0.0034877 -0.0055305 -0.1129527 -1.7509583 -0.0644001 0.0080758 -0.3001251 0.0110922 -0.0076041 0.0077854 -0.0095186 -0.2294989 2.2731947 -0.0556514 -0.0022341 0.4714598 0.6922817 -0.0272223 -0.0190022 -0.0260031 0.0725149 0.0818571 -0.0141747 -0.0019198 -0.0128197 -0.0973637 0.0070558 -0.0259363 0.0093663 0.1685798 -0.1583503 0.0595281 0.0833532 0.1146522 0.0768378 0.0481703 0.2261484 -0.0168181 -0.1179252 0.0694861 -0.1050265 0.0225685 0.0004789 -0.1027958 0.0188714 0.0056408 0.021982 0.1181763 -0.1700346 0.0335245 -0.0939834 0.0065842 0.0825052 -0.068419 -0.16771 -0.0271188 -0.0359006 -0.1628067 -0.0647311 -0.0318134 -0.0144502 0.0912949 0.0102241 -0.0339071 0.0010173 0.1146464 0.1089279 0.0992854 0.1093365 -0.0419027 -0.0084032 -0.040873 0.0161333 -0.0758122 -0.0340849 0.1104243 0.0563902 -0.0798876 -0.1178767 -0.023749 0.0460554 0.038407 0.1081368 -0.1008087 0.031371 -0.0124173 0.0015618 -0.064031 -0.0955824 0.01458 0.0049464 0.010666 0.1956378 0.0540216 0.0000963 0.0002577 -0.0347723 -0.1364406 0.0124818 0.0013147 0.0113721 0.1555592 0.0372086 -0.0251034 0.0006421 -0.0360659 -0.1039216 0.0112022 0.0011081 0.0112539 0.1820821 0.0566118 0.1108648 -0.0047156 -0.0977801 -0.3256521 0.0181579 0.0038655 0.0174967 0.1114874 unknown
polarizability: 233.104499|-4.9590662|75.2961251|-1.0626946|-0.8481867|46.4450464 unknown
InChI: InChI=1S/C7H11NO/c1-8(2)6-4-3-5-7-9/h3-7H,1-2H3
charge 0 multiplicity 1
20 atoms
O  -4.655293 0.154603 -0.010848
N  2.729412 -0.024217 0.022489
C  1.437505 -0.498494 0.014184
C  3.880588 -0.932656 -0.08575
C  2.987815 1.422358 -0.016048
C  0.275711 0.264246 -0.015265
C  -1.027276 -0.340722 0.011498
C  -2.237255 0.334758 -0.015929
C  -3.503626 -0.382512 0.01154
H  1.351588 -1.592268 0.041794
H  4.38153 -0.840654 -1.070458
H  3.546082 -1.976219 0.033102
H  4.624878 -0.717227 0.703706
H  4.065923 1.608223 0.112943
H  2.44535 1.934899 0.800198
H  2.666019 1.868651 -0.978698
H  0.330098 1.358266 -0.064931
H  -1.065053 -1.443069 0.056502
H  -2.278017 1.430802 -0.05875
H  -3.401781 -1.501068 0.056123
