program: Gaussian 09
title: 000138319
version: EM64L-G09RevD.01
frameworkgroup: C1[X(C14H20)]
method: RPBEPBE
basis: SDD
operation: Freq
keyword: #p
keyword: freq=noraman
keyword: PBEPBE/SDD
title: #p freq=noraman PBEPBE/SDD
converged: YES YES NO YES
title: Mulliken charges:
elementType: C C C C C C C C C C C C C C H H H H H H H H H H H H H H H H H H H H
charge: -0.407079 -0.407038 -0.386442 -0.386457 -0.406014 -0.406019 -0.597241 -0.597239 0.510063 0.510073 -0.425286 -0.415620 -0.415629 -0.425285 0.206666 0.221573 0.206667 0.221520 0.202588 0.199795 0.202605 0.199796 0.201030 0.208612 0.201031 0.208613 0.210348 0.208549 0.210346 0.208550 0.233261 0.235195 0.235208 0.233260
chargesum: 0.00000
title: Mulliken charges with hydrogens summed into heavy atoms:
elementType: C C C C C C C C C C C C C C
charge: 0.021160 0.021149 0.015941 0.015944 0.003628 0.003625 -0.178345 -0.178344 0.510063 0.510073 -0.192025 -0.180425 -0.180421 -0.192025
polarizability: 1.77302324e+02 -2.08319001e-03 1.18697221e+02 -9.14595035e-01 1.14843442e-03 1.27944918e+02
1716.lowfreq: -9.8295 -0.0006 -0.0003 -0.0002 20.7149 20.8876 71.6064 104.3651 131.4628
frequency: 69.4788 104.3438 131.4441 156.2641 173.6172 213.1944 227.4168 279.2652 291.2035 316.1218 359.8547 385.4321 392.0416 416.5061 423.1546 487.8390 489.7451 572.7553 634.2679 686.5387 689.1608 732.1378 762.1501 776.8586 806.0469 830.8934 840.9999 853.3810 867.6181 871.4863 928.5851 942.3088 949.1311 958.0196 969.7224 1007.3956 1011.2924 1026.9918 1060.9863 1061.5939 1076.6437 1082.0518 1110.0834 1131.7917 1154.0356 1177.9307 1187.7229 1204.2934 1215.6419 1218.8169 1221.7452 1241.7203 1271.6070 1275.6170 1294.7524 1301.6552 1308.9443 1317.0184 1324.5706 1337.9039 1340.8985 1345.1639 1349.1861 1380.2060 1408.8768 1462.7192 1463.1685 1469.7938 1470.7164 1471.8366 1473.0293 1477.8977 1491.0193 1506.0458 1578.5094 1618.5218 2967.0620 2967.1484 2972.2439 2972.8722 2974.0469 2978.5811 2980.2132 2981.2794 3020.2335 3020.3175 3025.6915 3027.2238 3041.8337 3042.1990 3049.3207 3068.5689 3104.4018 3105.9415 3127.0997 3134.0523
redmass: 3.0200 2.5136 3.8224 2.2775 2.6970 3.6662 1.9730 2.6258 2.5041 1.9522 2.1457 2.2430 3.6591 3.1307 2.7240 2.4023 3.7841 2.1743 6.4747 2.8411 1.2623 3.2052 1.6475 1.8683 1.7498 1.3702 2.1340 1.6377 2.0945 2.1476 2.0784 2.5454 2.0247 1.4209 1.3816 1.9864 2.8660 2.9808 2.1845 1.9647 2.5167 2.7150 1.4146 1.1259 1.1148 1.3537 1.1036 1.3508 3.4516 1.7013 1.2574 1.2478 1.2019 1.2034 1.1630 1.2777 1.2422 1.2764 1.2295 1.3516 1.4368 1.3175 1.3310 5.9334 2.5260 1.0882 1.0779 1.0746 1.0973 1.1083 1.0921 1.0637 1.1028 2.6776 6.3921 6.4554 1.0596 1.0595 1.0625 1.0714 1.0616 1.0637 1.0616 1.0635 1.1016 1.1019 1.0970 1.0963 1.1023 1.1029 1.0909 1.0993 1.0865 1.0867 1.0961 1.0972
irintensity: 0.0350 0.0117 0.1108 0.1136 0.2204 0.3483 0.2176 0.0916 0.0128 0.5498 0.1797 0.0002 0.2911 0.2989 0.0240 0.6001 5.1995 23.4280 0.0182 1.0344 24.7875 7.1127 2.3679 1.8626 27.6886 3.3055 8.6866 2.4543 8.9047 19.9397 0.1363 1.6016 3.0493 1.0760 0.0009 11.0505 1.0823 1.8412 2.1240 2.7126 0.2890 0.4818 9.4271 1.0083 2.7424 0.0066 0.5455 3.0880 1.5806 0.8777 0.6918 0.1223 1.5110 0.0019 0.0193 2.7568 0.0710 0.0002 1.4352 2.2053 0.0321 0.1425 0.0080 1.3204 3.9045 6.9864 4.0937 17.3083 0.3234 5.5237 4.9182 3.1579 28.3630 24.2100 0.0559 4.6024 7.4551 50.9153 4.1553 24.1025 22.6744 61.0479 125.5501 0.8193 14.8834 46.9061 39.1393 97.4470 69.4536 0.2710 50.4301 72.3037 0.0002 26.4741 43.2554 0.4534
temp: 298.150 k
press: 1.00000 atm
elementType: 6 6 6 6 6 6 6 6 6 6 6 6 6 6 1 1 1 1 1 1 1 1 1 1 1 1 1 1 1 1 1 1 1 1
symmnumber: 1
zpe: 795993.4 jmol-1
zpe.correction: 0.303178 hartree
zpe.thermalcorrener: 0.315854 hartree
zpe.thermalcorrenthalpy: 0.316798 hartree
zpe.thermalcorrgfe: 0.265344 hartree
zpe.sumelectzpe: -544.401267 hartree
zpe.sumelectthermal: -544.388591 hartree
zpe.sumelectthermalent: -544.387647 hartree
zpe.sumelectthermalfe: -544.439101 hartree
dipole: 0.0001 0.8330 0.0000
dipole: 0.8330
quadrupole: -81.1299 -92.2300 -82.1113
quadrupole: -0.0005 -0.0589 0.0006
quadrupole: 4.0271 -7.0729 3.0457 -0.0005 -0.0589 0.0006
hfenergy: -544.7044446 hartree
pointgroup: C01 [X(C14H20)]
dipole: 0.0000661 0.3277242 0.0000092 debye
polarizability: 177.3036178|-0.0074228|118.6972216|-0.8789605|0.000486|127.9436236 unknown
InChI: InChI=1S/C14H20/c1-2-4-6-8-14-11-9-13(10-12-14)7-5-3-1/h9-12H,1-8H2
charge 0 multiplicity 1
34 atoms
C  -0.655171 2.028906 0.419026
C  0.655901 2.029158 -0.41854
C  -1.960298 1.774244 -0.409659
C  1.960986 1.7737 0.40998
C  -2.987327 0.815846 0.276924
C  2.987572 0.815023 -0.27688
C  -2.870529 -0.702059 -0.118884
C  2.870305 -0.702867 0.118795
C  -1.429345 -1.180228 -0.055997
C  1.428973 -1.180602 0.055903
C  -0.655321 -1.291964 -1.240056
C  0.755486 -1.302859 -1.185953
C  -0.755894 -1.30279 1.185848
C  0.654922 -1.292256 1.239949
H  -0.75039 2.981335 0.979515
H  -0.561015 1.235247 1.180187
H  0.751235 2.982011 -0.978286
H  0.561655 1.236098 -1.180317
H  -1.685461 1.354393 -1.398219
H  -2.45992 2.740152 -0.619501
H  1.686043 1.353731 1.398462
H  2.461047 2.739338 0.620017
H  -4.021123 1.137287 0.038919
H  -2.879276 0.907242 1.376396
H  4.021511 1.13608 -0.038974
H  2.879405 0.906594 -1.376328
H  -3.260578 -0.831254 -1.147021
H  -3.526895 -1.286778 0.555631
H  3.260312 -0.832251 1.146924
H  3.526496 -1.287756 -0.555747
H  -1.161318 -1.285199 -2.21381
H  1.334516 -1.300176 -2.118186
H  -1.334925 -1.300039 2.11808
H  1.160919 -1.285708 2.213704
