program: Gaussian 09
title: 000138317
version: EM64L-G09RevD.01
frameworkgroup: C1[X(C20H12)]
method: RPBEPBE
basis: SDD
operation: Freq
keyword: #p
keyword: freq=noraman
keyword: PBEPBE/SDD
title: #p freq=noraman PBEPBE/SDD
converged: NO YES NO NO
title: Mulliken charges:
elementType: C C C C C C C C C C C C C C C C C C C C H H H H H H H H H H H H
charge: -0.524029 -0.298681 0.467357 0.467355 0.418875 0.418873 0.107487 0.107491 -0.429912 -0.429912 -0.473084 -0.473084 -0.386201 -0.386203 -0.176570 -0.176573 -0.231591 -0.231590 -0.258377 -0.258376 0.233509 0.233509 0.249272 0.249272 0.240884 0.240886 0.199326 0.199326 0.224221 0.224221 0.226159 0.226159
chargesum: 0.00000
title: Mulliken charges with hydrogens summed into heavy atoms:
elementType: C C C C C C C C C C C C C C C C C C C C
charge: -0.524029 -0.298681 0.467357 0.467355 0.418875 0.418873 0.107487 0.107491 -0.196403 -0.196402 -0.223812 -0.223812 -0.145317 -0.145318 0.022757 0.022754 -0.007370 -0.007369 -0.032218 -0.032217
polarizability: 3.57923357e+02 -5.56118608e-05 3.27886272e+02 3.03848941e-03 2.93685902e-03 7.98350985e+01
1716.lowfreq: -4.4115 -0.0011 -0.0002 0.0008 3.9506 9.9106 74.2799 93.9205 107.6611
frequency: 74.2798 93.9197 107.6587 145.2606 157.0248 213.9262 226.3108 273.1260 286.7130 362.9395 367.9611 411.0571 416.6136 417.9755 458.3811 501.1811 527.0095 559.6933 561.0268 567.8969 609.0042 620.7366 649.0551 664.6787 694.6310 742.1122 742.1174 745.0058 756.9159 781.3871 801.8676 814.0532 847.1195 872.0626 884.3972 911.3603 912.7248 924.7858 933.3062 945.0467 947.8987 959.9994 970.8105 980.5846 982.0565 1002.3604 1016.3286 1021.6777 1056.0573 1077.8798 1118.0580 1145.4771 1161.7721 1177.0878 1200.2600 1220.7499 1246.4041 1280.9106 1287.1303 1311.8279 1346.4846 1348.8086 1388.0247 1399.9726 1409.1535 1425.0339 1440.7308 1442.7358 1466.4080 1500.3078 1513.1034 1525.3185 1564.6326 1569.1763 1593.9400 1610.1595 1616.5006 1634.3521 3087.2738 3103.2873 3116.0956 3120.4526 3120.5406 3128.2690 3128.3756 3129.5296 3145.3535 3147.3669 3161.3925 3162.1178
redmass: 5.1540 4.1759 4.1242 4.9790 3.6664 4.9411 4.7479 3.5302 5.0902 5.9469 6.5431 3.1477 7.4430 3.3878 3.6485 3.6060 5.7680 5.8665 6.8368 3.2540 3.7004 7.1335 3.4880 6.2491 6.6321 5.7357 1.4179 1.3751 1.3085 3.1140 2.5055 3.9563 7.1826 1.4529 1.6775 6.3563 1.4978 5.5876 7.2044 1.4211 1.4424 1.4591 3.1325 1.3455 1.3470 1.3609 2.0748 2.0377 3.6876 3.1259 1.6093 1.5884 1.2353 1.2803 1.6036 2.3397 1.9280 1.3565 1.6636 1.5701 1.8368 3.3136 2.1615 3.1389 3.6502 3.1613 1.8132 2.7496 3.1464 8.4853 5.9956 4.5654 6.0066 6.0702 5.4132 7.1264 6.9125 9.2458 1.0825 1.0877 1.0910 1.0862 1.0862 1.0924 1.0892 1.0911 1.0942 1.0940 1.0999 1.0999
irintensity: 3.3822 0.0000 1.7859 0.1876 0.0000 0.6767 0.0000 0.0704 0.1266 0.4631 0.1480 0.0000 2.3833 1.7551 4.9168 0.0000 2.7434 0.2793 2.7330 0.0000 6.8754 1.2603 0.0000 2.1338 0.5054 1.3590 189.8393 43.2528 0.0000 0.0000 16.9864 12.7854 0.0583 0.0000 4.1662 2.8538 0.0000 7.8770 0.0147 0.0000 5.6177 5.8788 0.4581 0.0000 0.5958 0.0000 13.7639 3.4610 0.3265 1.6132 18.6073 13.3039 0.6246 7.9901 7.5998 0.0324 13.5039 0.0477 26.1176 7.6372 0.1934 2.4371 6.0763 4.7567 0.0510 25.3160 23.3823 7.5232 16.2919 7.8432 14.7419 74.4972 2.5395 12.1148 2.2195 68.0058 64.7080 139.0991 0.0769 13.0714 20.5627 0.1117 13.8418 13.8741 0.0159 53.4816 22.9132 20.9994 63.8594 29.2670
temp: 298.150 k
press: 1.00000 atm
elementType: 6 6 6 6 6 6 6 6 6 6 6 6 6 6 6 6 6 6 6 6 1 1 1 1 1 1 1 1 1 1 1 1
symmnumber: 1
zpe: 652518.4 jmol-1
zpe.correction: 0.248531 hartree
zpe.thermalcorrener: 0.262013 hartree
zpe.thermalcorrenthalpy: 0.262957 hartree
zpe.thermalcorrgfe: 0.208792 hartree
zpe.sumelectzpe: -768.025057 hartree
zpe.sumelectthermal: -768.011575 hartree
zpe.sumelectthermalent: -768.010631 hartree
zpe.sumelectthermalfe: -768.064796 hartree
dipole: 0.0000 1.7405 0.0003
dipole: 1.7405
quadrupole: -97.7792 -92.8815 -124.3071
quadrupole: 0.0000 0.0003 0.0010
quadrupole: 7.2101 12.1078 -19.3178 0.0000 0.0003 0.0010
hfenergy: -768.2735879 hartree
pointgroup: C01 [X(C20H12)]
dipole: -0.000021 0.6847657 -0.000125 debye
polarizability: 357.9233571|0.0011228|327.886272|0.0030386|-0.0029368|79.8350985 unknown
InChI: InChI=1S/C20H12/c1-3-9-15-13(7-1)17-11-5-6-12-18-14-8-2-4-10-16(14)19(15)20(17)18/h1-12H
charge 0 multiplicity 1
32 atoms
C  -0.000024 0.67966 -0.000015
C  0.000026 -0.721596 0.000026
C  -1.341712 1.218635 -0.000134
C  1.341627 1.218736 -0.000084
C  -1.392203 -1.163439 -0.000059
C  1.39229 -1.163338 -0.000027
C  -2.224861 0.03492 -0.000195
C  2.224862 0.035082 -0.000137
C  -1.655945 2.579419 -0.00019
C  1.655755 2.579543 -0.000137
C  -2.004885 -2.437318 -0.000047
C  2.005062 -2.437174 -0.000035
C  -3.631294 -0.068075 -0.000293
C  3.631303 -0.067812 -0.000216
C  -0.705607 3.654637 -0.000161
C  0.705335 3.654691 -0.000143
C  -3.417044 -2.519741 -0.000177
C  3.417228 -2.519493 -0.000126
C  -4.226531 -1.351393 -0.00031
C  4.22663 -1.351087 -0.000217
H  -2.714851 2.870436 -0.000281
H  2.714639 2.870639 -0.000205
H  -1.400873 -3.350647 0.000054
H  1.401116 -3.350547 0.000022
H  -4.261366 0.829363 -0.000367
H  4.261307 0.82967 -0.000274
H  -1.155177 4.65797 -0.000192
H  1.154832 4.658057 -0.00017
H  -3.899015 -3.504391 -0.000185
H  3.899268 -3.50411 -0.000137
H  -5.31757 -1.448241 -0.00041
H  5.317675 -1.447857 -0.000277
