program: Gaussian 09
title: 000138316
version: EM64L-G09RevD.01
frameworkgroup: C1[X(C10H12O4)]
method: RPBEPBE
basis: SDD
operation: Freq
keyword: #pfreq=noraman
keyword: PBEPBE/SDD
title: #p freq=noraman PBEPBE/SDD
converged: NO YES NO NO
title: Mulliken charges:
elementType: O O O O C C C C C C C C C C H H H H H H H H H H H H
charge: -0.270799 -0.270795 -0.418416 -0.212165 0.576021 -0.675580 -0.562594 -0.558518 0.375990 0.376621 -0.511481 0.189332 -0.537333 -0.537161 0.261649 0.261249 0.243947 0.243714 0.275114 0.217843 0.224171 0.245286 0.245397 0.223561 0.217999 0.376947
chargesum: 0.00000
title: Mulliken charges with hydrogens summed into heavy atoms:
elementType: O O O O C C C C C C C C C C
charge: -0.270799 -0.270795 -0.041469 -0.212165 0.576021 -0.152683 -0.318646 -0.314804 0.375990 0.376621 -0.236366 0.189332 0.149967 0.149796
polarizability: 1.37672226e+02 -2.93798627e-01 1.51744539e+02 -1.09838532e+01 2.86735859e-01 8.00227100e+01
1716.lowfreq: -20.3725 -9.1286 -3.8130 -0.0003 0.0002 0.0003 7.0003 21.5511 67.1956
frequency: -20.2239 21.1657 67.1918 78.5393 105.8101 176.6582 186.8197 202.7129 203.8024 250.1549 254.7916 270.6342 321.5088 347.2374 355.7503 471.0980 487.9195 531.5026 542.8314 569.5798 575.0818 604.3343 636.5862 667.6802 703.2869 811.5631 834.0993 862.2223 868.4897 876.0334 935.0487 952.1929 977.0968 1014.2565 1038.7770 1044.4104 1111.9275 1112.2333 1133.2715 1158.8410 1159.9807 1174.9836 1179.5633 1242.0811 1273.6187 1304.0773 1340.7726 1401.8299 1425.5561 1441.2673 1444.2664 1461.4871 1463.0199 1465.9158 1466.1619 1471.9157 1482.4901 1601.1551 1625.4339 1680.4157 2958.3687 2958.7331 3004.4104 3045.6688 3045.9487 3056.2611 3126.0646 3126.2702 3156.1358 3160.0438 3186.8556 3514.7843
redmass: 11.1880 4.7978 3.5390 4.8704 3.5750 3.3663 1.5137 1.8676 2.3353 4.5823 1.9818 1.8098 6.3974 2.5058 4.8567 5.7525 2.0713 5.4880 4.9221 4.2446 3.3928 4.5427 1.4068 3.1580 2.3420 2.2376 1.4730 5.4858 1.6952 2.7175 2.3206 6.3370 5.7908 5.0884 2.5022 2.3939 1.2591 1.2592 1.8884 1.4458 1.6432 1.4216 1.1687 1.5613 1.2767 3.3233 2.4499 6.6655 1.3779 1.1204 1.2094 2.2203 1.6439 1.0508 1.0589 1.0541 1.6548 6.2929 7.0507 8.4024 1.0331 1.0332 1.0612 1.1039 1.1039 1.0985 1.0991 1.0991 1.0908 1.0917 1.0927 1.0640
irintensity: 0.7924 0.0843 9.6400 2.9843 0.0274 3.6746 0.0027 1.6783 0.5045 2.0628 1.5694 0.0013 1.1423 10.7764 0.9602 0.1364 11.9802 17.2861 2.1349 52.0408 25.2100 0.0122 123.7727 10.5821 35.7680 16.9795 0.1772 0.5962 19.3616 43.4999 0.1113 2.3625 10.7939 22.6459 320.1565 104.1284 0.3230 0.1028 186.9892 0.6912 148.3413 1.7579 1.8678 0.2456 8.4643 105.0101 23.8980 58.2949 27.3089 18.4099 18.5450 91.6181 15.0305 2.4313 23.3476 46.7621 1.1112 77.0599 258.9432 192.7764 104.1682 19.6425 15.4938 37.6770 60.2570 3.6867 25.0635 27.4941 11.3876 2.6788 0.0590 21.8317
temp: 298.150 k
press: 1.00000 atm
elementType: 8 8 8 8 6 6 6 6 6 6 6 6 6 6 1 1 1 1 1 1 1 1 1 1 1 1
symmnumber: 1
zpe: 531193.9 jmol-1
zpe.correction: 0.202321 hartree
zpe.thermalcorrener: 0.215759 hartree
zpe.thermalcorrenthalpy: 0.216703 hartree
zpe.thermalcorrgfe: 0.161217 hartree
zpe.sumelectzpe: -688.085301 hartree
zpe.sumelectthermal: -688.071863 hartree
zpe.sumelectthermalent: -688.070919 hartree
zpe.sumelectthermalfe: -688.126405 hartree
dipole: 2.5353 -0.0592 -1.7842
dipole: 3.1007
quadrupole: -81.8631 -60.1624 -88.0062
quadrupole: 0.0421 0.0877 -0.3917
quadrupole: -5.1858 16.5148 -11.3290 0.0421 0.0877 -0.3917
hfenergy: -688.2876225 hartree
pointgroup: C01 [X(C10H12O4)]
dipole: -0.9942038 -0.0126199 0.7068411 debye
dipolederiv: -0.4777666 -0.4746167 0.0373218 -0.3552172 -1.5731902 0.0791265 0.0452172 0.1273212 -0.3129569 -0.4685162 0.4616857 0.0372477 0.3428598 -1.5817443 -0.0829391 0.0442672 -0.1302329 -0.3135491 -1.4134284 -0.0273749 0.3331431 -0.0289458 -0.420728 0.0002464 0.1780166 -0.0006443 -0.3243024 -0.7171897 -0.0019035 -0.0297499 -0.0185131 -0.2662966 0.0280014 0.1602976 0.0309739 -0.9094132 0.3220584 0.0000223 -0.0223506 0.0039925 0.4091341 0.0037697 -0.0220688 0.0019169 -0.0377791 -0.0423267 -0.0015743 -0.0937344 -0.0036069 0.1217148 0.0002163 -0.3019897 0.0059054 -0.1776099 -0.4168417 0.3215819 0.0219691 0.061585 -0.32021 -0.005066 0.0596388 -0.0639834 -0.2376247 -0.4167445 -0.3225165 0.0235526 -0.0635998 -0.314702 0.0036374 0.0649649 0.0594643 -0.2357759 0.5418911 0.6531287 -0.1084936 0.3776984 1.3201092 -0.0835437 -0.1243101 -0.1729651 0.1525704 0.5313173 -0.6425825 -0.1081474 -0.3674148 1.331022 0.0880423 -0.1219257 0.1759647 0.1528908 -0.0711425 -0.0034769 -0.048542 -0.0044639 -0.7553667 -0.0006962 -0.044096 -0.0000575 -0.2004566 1.7450849 0.0316791 -0.1377105 0.0438129 0.1700713 -0.0436006 -0.056226 -0.044569 1.2061034 0.1971163 -0.2620873 0.027641 0.0565969 0.8277317 -0.0072229 0.0335203 0.068632 0.3158529 0.1994197 0.269683 0.0291205 -0.0495736 0.8252019 0.0084832 0.0328364 -0.0676037 0.3161911 0.0283489 0.0212291 -0.0003382 0.0710132 -0.0076214 -0.0958237 0.033541 -0.0472085 0.0693155 0.0274693 -0.0216027 0.001838 -0.0678131 -0.009026 0.0968092 0.0332871 0.046657 0.0720661 0.0594895 -0.0982962 0.0370044 -0.0818787 -0.0427389 0.0141291 0.0345311 0.0194266 0.1500608 0.0615097 0.0968207 0.036779 0.0809287 -0.0442197 -0.0152057 0.0339773 -0.0185983 0.1491913 0.0014686 0.0006448 0.0491889 0.000581 0.1167188 -0.0003869 0.0533812 -0.0003856 0.1710637 0.0637414 0.1372138 0.084941 -0.0014051 -0.0105406 0.0101606 0.0605061 -0.0905581 -0.1416693 -0.0441679 0.1566132 -0.1317458 -0.0101029 -0.0043783 -0.0123437 -0.1110388 0.0060091 -0.0261021 -0.0100823 -0.1426928 0.035477 -0.0952251 -0.0669362 0.0258863 0.036742 0.0396137 0.1123093 -0.0072744 0.1418732 0.0353 0.0945072 -0.069448 -0.0265932 0.0363491 -0.0403269 0.1122086 -0.0463522 -0.1564336 -0.1325207 0.0107776 -0.0032499 0.0136874 -0.111386 -0.0050721 -0.0268608 0.0621662 -0.1382061 0.0845436 0.0004836 -0.0089229 -0.0109998 0.0614968 0.0897914 -0.1413046 0.290752 0.0011883 -0.0617345 0.0029232 0.3776162 0.0122256 -0.1095296 0.0105291 0.1055809 unknown
polarizability: 137.5701873|0.4069595|151.736844|-11.2683684|-0.308138|80.1324438 unknown
InChI: InChI=1S/C10H12O4/c1-13-8-3-7(5-10(11)12)4-9(6-8)14-2/h3-4,6,11H,5H2,1-2H3
charge 0 multiplicity 1
26 atoms
O  2.212285 2.357177 -0.201338
O  2.185108 -2.387121 -0.20668
O  -4.369476 -0.017777 0.229862
O  -2.768624 0.09263 -1.448815
C  -0.614688 0.000534 0.569171
C  -2.083098 0.007583 0.954909
C  0.054065 -1.23051 0.38381
C  0.068358 1.224003 0.387245
C  1.435519 1.205618 0.00944
C  1.421521 -1.227102 0.006443
C  2.116727 -0.014491 -0.179123
C  -3.03909 0.030377 -0.234167
C  1.553298 3.655975 -0.050006
C  1.511654 -3.678654 -0.057084
H  -2.332078 0.885306 1.580947
H  -2.346977 -0.877032 1.563818
H  -0.492082 -2.167528 0.525174
H  -0.467345 2.166858 0.529552
H  3.170052 -0.020162 -0.468459
H  1.180494 3.802593 0.982729
H  0.71662 3.769495 -0.766522
H  2.333164 4.399338 -0.270068
H  2.283214 -4.430411 -0.277918
H  0.673928 -3.78209 -0.77395
H  1.136932 -3.822454 0.975356
H  -4.985081 0.006645 -0.552426
