program: Gaussian 09
title: 000138313
version: EM64L-G09RevD.01
frameworkgroup: C1[X(C4H10Cl2O2Si)]
method: RPBEPBE
basis: SDD
operation: Freq
keyword: #p
keyword: freq=noraman
keyword: PBEPBE/SDD
title: #p freq=noraman PBEPBE/SDD
converged: YES YES NO NO
title: Mulliken charges:
elementType: Cl Cl Si O O C C C C H H H H H H H H H H
charge: -0.290279 -0.290280 1.181154 -0.563238 -0.563247 -0.207279 -0.207282 -0.646662 -0.646661 0.218038 0.224869 0.218034 0.224874 0.206836 0.235822 0.231321 0.206837 0.235824 0.231318
chargesum: 0.00000
title: Mulliken charges with hydrogens summed into heavy atoms:
elementType: Cl Cl Si O O C C C C
charge: -0.290279 -0.290280 1.181154 -0.563238 -0.563247 0.235628 0.235626 0.027318 0.027318
polarizability: 9.92392558e+01 2.56227284e-04 8.69163307e+01 -4.62295765e+00 -1.12959831e-03 8.89716879e+01
1716.lowfreq: -0.0030 -0.0019 0.0011 1.8848 8.9226 11.8736 16.0778 35.7197 39.0166
frequency: 13.9525 35.5409 38.9582 43.4991 85.2399 85.3018 126.3909 192.0031 214.3652 225.5427 241.0504 260.2173 291.2896 301.5911 396.0739 443.8612 542.9206 645.7685 705.9516 806.3630 806.3914 936.0227 961.5776 1051.5172 1054.0044 1103.3316 1103.3559 1134.1666 1134.6239 1263.9316 1264.5611 1361.4726 1362.7552 1394.5399 1394.7212 1456.7494 1456.7925 1476.5197 1477.1970 1488.8045 1489.5567 2983.8953 2984.0375 2995.8599 2996.0710 3046.0064 3046.5069 3092.8813 3092.9146 3111.7359 3111.9415
redmass: 3.5518 3.9448 2.0728 1.7651 7.0738 4.5942 17.3323 6.8262 2.7305 2.6265 1.1914 2.1177 5.5677 5.5527 4.2359 7.2878 25.1009 5.7986 5.1442 1.0899 1.0897 2.6078 2.4704 5.6740 4.4914 2.2177 2.1859 1.4401 1.4436 1.1320 1.1311 1.2355 1.2349 1.2491 1.2505 1.0404 1.0403 1.0526 1.0508 1.0793 1.0807 1.0552 1.0551 1.0374 1.0376 1.1083 1.1083 1.0981 1.0981 1.1022 1.1022
irintensity: 1.5211 0.1576 3.2988 3.2132 0.8285 1.1535 0.4820 27.8894 1.2448 10.6829 1.9204 18.3995 6.8553 0.3551 0.7652 47.4417 184.6181 71.5947 39.0394 2.6539 4.8741 62.9840 120.7611 572.1399 149.3043 17.0432 3.9821 9.9398 0.2776 0.2472 0.5489 6.6944 6.6793 9.0849 46.2809 5.8864 19.2415 7.7789 1.7801 17.3239 0.4288 64.8785 6.9610 31.2902 11.0126 8.3754 28.0412 3.5689 53.4624 13.3975 55.2653
temp: 298.150 k
press: 1.00000 atm
elementType: 17 17 14 8 8 6 6 6 6 1 1 1 1 1 1 1 1 1 1
symmnumber: 1
zpe: 372818.1 jmol-1
zpe.correction: 0.141999 hartree
zpe.thermalcorrener: 0.155493 hartree
zpe.thermalcorrenthalpy: 0.156437 hartree
zpe.thermalcorrgfe: 0.097769 hartree
zpe.sumelectzpe: -1517.742257 hartree
zpe.sumelectthermal: -1517.728763 hartree
zpe.sumelectthermalent: -1517.727818 hartree
zpe.sumelectthermalfe: -1517.786486 hartree
dipole: 0.0003 -3.4578 -0.0003
dipole: 3.4578
quadrupole: -63.9939 -76.4332 -82.1697
quadrupole: 0.0011 -3.3348 0.0005
quadrupole: 10.2050 -2.2343 -7.9708 0.0011 -3.3348 0.0005
hfenergy: -1517.8842558 hartree
pointgroup: C01 [X(C4H10Cl2O2Si1)]
dipole: 0.0002709 -1.3604092 0.0000638 debye
dipolederiv: -0.4259763 -0.042652 0.0950495 0.021123 -0.5206597 0.1804274 0.0326095 0.2619735 -0.6515755 -0.4259905 0.0426853 0.0950891 -0.0210968 -0.5206961 -0.1804104 0.0326833 -0.2619922 -0.6515488 2.3504629 0.0000674 -0.3992038 0.0000146 2.0452304 -0.0000347 0.0617333 0.0000487 1.9436193 -1.5346321 -0.5086386 0.2313017 -0.5301844 -0.9419219 0.0921745 0.2616909 0.1198331 -0.6630144 -1.5350122 0.5084792 0.2313012 0.5300215 -0.9416157 -0.0920903 0.2616447 -0.1197366 -0.6629841 0.9071913 0.3477386 -0.128216 0.349293 0.551153 -0.080577 -0.4445917 -0.2733004 0.3508875 0.9074766 -0.3476782 -0.1282045 -0.3491479 0.5509172 0.080535 -0.4446332 0.2731728 0.3508704 -0.1399687 -0.0906529 -0.0652973 -0.1016917 0.0003811 -0.0204874 -0.0161301 0.0070225 0.0147174 -0.1399725 0.0906536 -0.0653115 0.1016768 0.0004044 0.0204983 -0.0161299 -0.0070058 0.0146978 -0.0606817 0.0398374 -0.0606992 0.0015916 -0.0829891 0.1145042 0.0164183 0.119767 -0.0199479 -0.0102329 -0.0252888 0.0376323 0.0143599 -0.047165 -0.1133533 0.1062253 -0.0405031 -0.040718 -0.060662 -0.0397863 -0.0607119 -0.0015618 -0.0829074 -0.114531 0.0164312 -0.1197962 -0.0200471 -0.0102858 0.0252611 0.0376355 -0.0144137 -0.0472286 0.1133446 0.1062407 0.0405299 -0.0406234 -0.059007 -0.1013578 0.081231 -0.1021353 0.0592457 0.0524838 0.0938222 0.0581531 0.0034069 0.071798 0.0595166 -0.0477776 0.0924402 -0.0347692 0.0906446 -0.0846971 0.0609873 0.037777 0.0763592 0.0765527 0.0563584 0.047929 -0.0059304 -0.1046771 0.0037784 -0.1197975 -0.0033585 -0.0590915 0.1013255 0.0812594 0.1020993 0.0593207 -0.0524177 0.09385 -0.0580851 0.0034182 0.0718661 -0.0594643 -0.0477751 -0.0923651 -0.0347311 -0.0907061 -0.0847122 -0.0610476 0.0376814 0.0763592 -0.0765987 0.0563389 -0.0479521 -0.0060383 0.1046726 0.0037665 0.1197766 -0.0032581 unknown
polarizability: 98.625919|0.0006452|86.9163304|-5.2242733|-0.0012991|89.585025 unknown
InChI: InChI=1S/C4H10Cl2O2Si/c1-3-7-9(5,6)8-4-2/h3-4H2,1-2H3
charge 0 multiplicity 1
19 atoms
Cl 0.397953 1.76723 -1.758938
Cl -0.398317 1.767269 1.758642
Si -0.000049 0.545003 -0.000109
O  -1.380542 -0.354308 -0.396487
O  1.380613 -0.354019 0.396336
C  -2.384307 -0.947229 0.520967
C  2.384714 -0.946498 -0.521033
C  -3.545465 -1.444077 -0.334935
C  3.545681 -1.443508 0.335035
H  -1.907633 -1.776683 1.077932
H  -2.7125 -0.174328 1.242354
H  1.908312 -1.775813 -1.07844
H  2.713028 -0.173302 -1.242047
H  -4.317261 -1.9038 0.310168
H  -4.002519 -0.608578 -0.891095
H  -3.199024 -2.199489 -1.060164
H  4.317742 -1.902868 -0.310009
H  4.002441 -0.608154 0.891654
H  3.199131 -2.199249 1.059869
