program: Gaussian 09
title: 000138310
version: EM64L-G09RevD.01
frameworkgroup: C1[X(C7H6)]
method: RPBEPBE
basis: SDD
operation: Freq
keyword: #p
keyword: freq=noraman
keyword: PBEPBE/SDD
title: #p freq=noraman PBEPBE/SDD
converged: YES YES NO NO
title: Mulliken charges:
elementType: C C C C C C C H H H H H H
charge: -0.553180 0.141293 0.141292 -0.350768 -0.350768 -0.211335 -0.211335 0.241175 0.241042 0.232418 0.232418 0.223874 0.223874
chargesum: 0.00000
title: Mulliken charges with hydrogens summed into heavy atoms:
elementType: C C C C C C C
charge: -0.070963 0.141293 0.141292 -0.118350 -0.118349 0.012539 0.012539
polarizability: 9.21432957e+01 -2.42206164e-05 7.64108642e+01 1.80632587e-02 -8.18838235e-05 3.37905126e+01
1716.lowfreq: -6.0825 -3.3861 0.0003 0.0006 0.0007 14.1345 192.2571 340.5749 415.9789
frequency: 192.2570 340.5746 415.9778 439.6412 565.5877 655.4167 693.8158 745.1960 858.8253 885.6532 917.5104 977.6240 984.1710 986.9873 989.5166 989.7339 1078.5857 1096.5675 1102.8307 1172.6339 1260.6528 1374.0514 1434.7565 1439.7506 1459.8791 1576.3184 1719.5025 3031.4594 3120.8198 3121.8940 3134.8507 3147.1481 3159.8846
redmass: 3.1280 2.7166 4.0357 3.3739 6.4363 7.1516 3.7558 1.1747 4.9765 1.2589 1.4032 1.2885 2.3186 7.0566 1.1975 1.3204 1.2643 3.7560 1.4463 1.1134 1.3632 2.8067 2.2157 2.8166 1.1756 7.9477 9.7789 1.0527 1.0852 1.1152 1.0901 1.0962 1.1000
irintensity: 15.9537 3.2427 18.7663 0.0061 0.1084 0.6368 0.0003 90.7372 4.2082 0.0000 0.0021 0.0003 8.9025 1.9638 0.0019 2.8643 23.9248 1.4562 0.9450 1.2850 0.0977 3.1273 12.5910 8.9391 6.4060 3.9943 11.1475 65.8697 0.0144 20.6072 6.1397 48.6677 24.5770
temp: 298.150 k
press: 1.00000 atm
elementType: 6 6 6 6 6 6 6 1 1 1 1 1 1
symmnumber: 1
zpe: 269578.9 jmol-1
zpe.correction: 0.102677 hartree
zpe.thermalcorrener: 0.108051 hartree
zpe.thermalcorrenthalpy: 0.108995 hartree
zpe.thermalcorrgfe: 0.073849 hartree
zpe.sumelectzpe: -269.758742 hartree
zpe.sumelectthermal: -269.753368 hartree
zpe.sumelectthermalent: -269.752424 hartree
zpe.sumelectthermalfe: -269.787570 hartree
dipole: 0.1493 0.0000 0.0102
dipole: 0.1496
quadrupole: -35.5211 -37.7057 -43.6788
quadrupole: 0.0000 -0.0030 0.0000
quadrupole: 3.4475 1.2628 -4.7103 0.0000 -0.0030 0.0000
hfenergy: -269.8614191 hartree
pointgroup: C01 [X(C7H6)]
dipole: -0.0586341 -0.0000081 -0.0051727 debye
dipolederiv: 0.1281449 0.000005 -0.0264283 0.0000008 0.0635792 0.0000004 -0.0291816 -0.0000042 0.2924183 -0.0151945 -0.046208 0.0176927 -0.376395 -0.2854118 -0.0602733 0.020005 -0.0085353 -0.1201579 -0.0152612 0.0462454 0.0176784 0.3764393 -0.2853559 0.0602765 0.0200099 0.0085434 -0.1201582 0.0718338 0.0208908 0.0301737 0.1020118 0.2514855 0.0154486 0.0291971 0.0027286 -0.1212485 0.0718567 -0.0209174 0.030174 -0.1020428 0.2514707 -0.0154417 0.029193 -0.002724 -0.1212492 -0.0010456 0.0142764 0.0258276 0.1236832 -0.0416073 0.0192084 0.0256845 0.0030315 -0.161691 -0.0010245 -0.014271 0.0258257 -0.1236783 -0.0416287 -0.0191974 0.0256799 -0.0030256 -0.1616924 -0.0860881 -0.0000163 -0.0850752 -0.0000118 0.1325619 -0.000007 -0.1437497 -0.0000114 -0.0888902 -0.1539521 -0.0000196 0.0639445 -0.0000229 0.1319962 0.0000028 0.1221865 0.0000083 -0.021212 0.0891996 -0.0147798 -0.0105276 -0.0234318 -0.127073 -0.0033121 -0.0102114 -0.0019502 0.155538 0.0891926 0.0148126 -0.0105254 0.0234655 -0.1270677 0.0033057 -0.0102093 0.0019491 0.1555385 -0.0888169 -0.0969632 -0.0393808 -0.0809292 0.0385124 -0.0125911 -0.0393018 -0.0152933 0.1564019 -0.0888446 0.096945 -0.0393791 0.0809112 0.0385385 0.0125802 -0.0393022 0.0152833 0.1564027 unknown
polarizability: 90.7415922|0.0009312|76.4108642|8.9346993|0.0012464|35.1922161 unknown
InChI: InChI=1S/C7H6/c1-2-4-7-5-6(7)3-1/h1-4H,5H2
charge 0 multiplicity 1
13 atoms
C  2.09083 0.000182 0.511914
C  0.731634 -0.689403 0.293711
C  0.731534 0.689575 0.293704
C  -0.403916 -1.479307 0.117959
C  -0.404143 1.479307 0.117997
C  -1.598709 -0.710478 -0.069733
C  -1.598819 0.710298 -0.069708
H  2.540688 0.000219 1.515351
H  2.830394 0.000231 -0.30197
H  -0.419694 -2.574278 0.117447
H  -0.42009 2.574275 0.117503
H  -2.55111 -1.233603 -0.218511
H  -2.551301 1.233282 -0.218465
