program: Gaussian 09
title: 000138308
version: EM64L-G09RevD.01
frameworkgroup: C1[X(C9H6ClNO)]
method: RPBEPBE
basis: SDD
operation: Freq
keyword: #p
keyword: freq=noraman
keyword: PBEPBE/SDD
title: #p freq=noraman PBEPBE/SDD
converged: YES YES NO NO
title: Mulliken charges:
elementType: Cl O N C C C C C C C C C H H H H H H
charge: -0.025266 -0.180835 0.005529 0.306457 -0.314946 -0.326291 0.129119 -0.220769 -0.209349 -0.546070 -0.101084 -0.128710 0.246107 0.286774 0.263272 0.266557 0.274837 0.274669
chargesum: 0.00000
title: Mulliken charges with hydrogens summed into heavy atoms:
elementType: Cl O N C C C C C C C C C
charge: -0.025266 -0.180835 0.005529 0.306457 -0.068839 -0.039517 0.129119 0.042503 0.057208 0.003436 -0.101084 -0.128710
polarizability: 1.94470370e+02 -7.91408730e+00 1.00880371e+02 1.43330117e-02 -1.98293798e-02 4.74340830e+01
1716.lowfreq: -2.8266 -0.0017 -0.0012 0.0018 6.3397 14.7456 35.9588 75.0997 93.0278
frequency: 35.9553 75.0876 93.0165 93.6124 180.2383 247.3549 250.1478 300.6365 358.3125 396.5462 406.0909 430.1810 458.1655 508.6938 568.8498 622.2336 697.7072 719.1778 789.0966 819.2760 846.1000 915.9888 928.5099 965.0372 995.2812 995.9995 1013.3435 1074.4035 1115.3864 1188.9596 1201.9900 1217.9995 1296.6320 1302.1987 1371.4770 1402.1027 1427.8326 1477.0402 1568.0267 1592.7153 1614.9180 2219.7210 2988.1192 3042.5751 3150.3232 3157.1347 3174.9342 3178.7148
redmass: 7.8573 4.5846 5.0327 10.2370 10.2735 6.0908 10.0737 7.5394 2.9517 9.1543 2.8748 7.7291 3.6712 7.6402 2.8035 7.1430 7.6141 3.6599 6.0372 1.3682 1.3240 7.2615 2.1580 1.4807 1.3823 4.4142 2.7967 2.9017 1.3671 1.1401 1.1054 2.5286 1.4084 1.6833 5.1063 4.1564 1.1234 2.2973 7.7148 6.3025 8.9070 12.4732 1.0592 1.0986 1.0884 1.0892 1.0962 1.0976
irintensity: 2.9020 12.3976 1.8496 4.4197 2.0147 0.0215 1.0593 0.4541 1.7533 6.4152 0.0448 0.2446 9.6236 24.3875 17.1343 1.0985 5.4482 0.8570 6.8745 43.7042 31.2117 77.7441 0.1362 0.0232 0.7159 50.0305 4.7899 69.7895 11.8199 22.1214 0.3355 131.3580 24.2888 102.6839 11.8149 22.1477 21.6277 15.3295 62.6048 169.4202 54.2956 7.7784 10.9780 0.5937 7.8263 0.5787 3.9209 1.3112
temp: 298.150 k
press: 1.00000 atm
elementType: 17 8 7 6 6 6 6 6 6 6 6 6 1 1 1 1 1 1
symmnumber: 1
zpe: 325825.9 jmol-1
zpe.correction: 0.124101 hartree
zpe.thermalcorrener: 0.134967 hartree
zpe.thermalcorrenthalpy: 0.135911 hartree
zpe.thermalcorrgfe: 0.085935 hartree
zpe.sumelectzpe: -935.733743 hartree
zpe.sumelectthermal: -935.722876 hartree
zpe.sumelectthermalent: -935.721932 hartree
zpe.sumelectthermalfe: -935.771908 hartree
dipole: 4.6629 -2.9011 0.0104
dipole: 5.4918
quadrupole: -112.8498 -69.4444 -76.4455
quadrupole: 8.9790 -0.0448 -0.0009
quadrupole: -26.6033 16.8022 9.8011 8.9790 -0.0448 -0.0009
hfenergy: -935.8578432 hartree
pointgroup: C01 [X(C9H6Cl1N1O1)]
dipole: 1.8082107 1.1826577 -0.0016528 debye
dipolederiv: -0.9525765 -0.098051 -0.0002035 -0.1020163 -0.1198946 -0.0001971 -0.0003505 -0.0002112 -0.0498072 -0.8666385 -0.1282757 -0.0002837 -0.3349982 -0.7430853 -0.0016322 -0.0001401 -0.0004442 -0.2848559 -0.294579 0.0538116 -0.000892 -0.0082027 -0.1832264 -0.0002478 0.0000057 -0.0002283 -0.222261 -0.9878563 -0.073754 0.0002882 0.0598118 -0.1280352 -0.0003844 0.0001348 -0.0002224 -0.0286314 0.2771785 -0.04976 -0.0001191 0.2033248 0.0588169 0.0005365 0.0000353 0.000416 -0.1210883 0.2000933 0.1382059 0.0004652 -0.2175426 0.03975 0.0005139 -0.0007034 0.0002957 -0.083806 1.9464242 0.020008 -0.0008465 -0.1394401 0.9237146 0.0026971 -0.0016461 0.0018012 0.1457546 -0.5646248 0.0804407 0.0002905 0.2029509 0.0084205 0.0003018 0.0006036 0.0003662 -0.1034372 -0.4166796 -0.2230325 -0.0005851 -0.2503379 -0.0722317 0.0000962 -0.0007073 0.0000588 -0.1027774 -0.2207804 0.1256734 0.0008671 0.3585914 -0.1655394 -0.001503 0.0020196 -0.0016951 0.2282536 1.4380752 0.1470242 0.0003738 0.114767 0.232927 0.0008001 0.0003494 0.0008424 -0.0495791 0.1803103 0.0106384 0.0006447 0.0857166 -0.0636594 0.000259 0.0003367 0.0002248 -0.0431434 0.0215972 0.0950548 0.0002495 0.1090494 -0.0065826 -0.0004893 0.0003149 -0.0004439 0.1450205 0.1092317 -0.0616033 -0.0002307 -0.0092009 0.0336417 -0.0003847 -0.0001147 -0.000322 0.1553222 0.0613658 -0.0516149 -0.000126 -0.0517235 -0.0047388 -0.0004989 -0.0000668 -0.0005331 0.1668781 0.0275459 0.0659941 0.0002226 0.0589608 0.0291975 -0.0003968 0.000225 -0.0003874 0.1663819 0.0205897 -0.0253872 -0.0369974 -0.0396687 0.0806044 -0.048039 -0.054027 -0.0634667 0.040837 0.0213232 -0.0253724 0.0368824 -0.0400418 0.0799208 0.0485686 0.0537308 0.0639491 0.0409388 unknown
polarizability: 194.0639439|10.0251503|101.2864167|-0.0695436|0.1328353|47.4344638 unknown
InChI: InChI=1S/C9H6ClNO/c10-8-3-1-7(2-4-8)9(12)5-6-11/h1-4H,5H2
charge 0 multiplicity 1
18 atoms
Cl 4.729328 0.37781 0.002139
O  -1.823858 -1.580794 -0.000855
N  -4.865677 0.249884 0.01027
C  0.132485 -0.169209 0.00032
C  0.703604 1.132975 0.004128
C  0.994711 -1.301054 -0.002871
C  -1.345451 -0.416732 -0.000452
C  2.102797 1.305475 0.004702
C  2.392575 -1.144665 -0.002399
C  -2.269932 0.828643 0.004506
C  2.92699 0.161738 0.001417
C  -3.699876 0.495548 0.005913
H  0.072217 2.027313 0.006713
H  0.543009 -2.29825 -0.005762
H  2.545443 2.305336 0.00765
H  3.056007 -2.013865 -0.004934
H  -2.041576 1.448388 0.893975
H  -2.044495 1.45326 -0.882261
