program: Gaussian 09
title: 000138301
version: EM64L-G09RevD.01
frameworkgroup: C1[X(C7H3Cl3O2)]
method: RPBEPBE
basis: SDD
operation: Freq
keyword: #p
keyword: freq=noraman
keyword: PBEPBE/SDD
title: #p freq=noraman PBEPBE/SDD
converged: NO NO NO NO
title: Mulliken charges:
elementType: Cl Cl Cl O O C C C C C C C H H H
charge: 0.050671 0.090097 0.093708 -0.141306 -0.128807 0.516610 -0.528318 0.163732 -0.246870 0.339817 -0.227524 -0.745587 0.261696 0.261696 0.240384
chargesum: 0.00000
title: Mulliken charges with hydrogens summed into heavy atoms:
elementType: Cl Cl Cl O O C C C C C C C
charge: 0.050671 0.090097 0.093708 -0.141306 -0.128807 0.516610 -0.528318 0.163732 -0.246870 0.339817 -0.227524 0.018190
polarizability: 1.42512345e+02 1.10670313e+01 1.58173605e+02 1.57111205e-03 4.68383875e-03 4.46996131e+01
1716.lowfreq: -3.4180 -0.8844 -0.0022 -0.0009 0.0014 7.1990 48.7269 63.3779 67.8228
frequency: 48.5345 63.3185 67.8213 95.7053 178.4567 188.8047 199.2005 256.9701 278.8238 302.9935 327.5080 344.1335 370.8272 410.6347 461.8606 501.9752 537.5800 683.2691 707.7448 721.0556 821.1097 825.6583 869.4467 995.8780 1034.4814 1036.2499 1126.3213 1196.0332 1265.7470 1397.3256 1447.1150 1453.0243 1550.9448 1563.9801 1567.7173 1621.8180 2996.2519 3072.9526 3123.2741
redmass: 2.9742 1.5105 7.0518 7.2413 8.0646 31.7861 20.7543 9.7827 6.3348 7.3179 9.3244 8.1069 12.6220 8.3022 13.8967 8.5514 6.9782 5.7222 11.5893 8.8356 8.6937 9.9550 5.7141 7.0493 1.5508 2.2916 5.8202 10.6373 6.9364 1.2178 1.0998 1.0444 12.2821 10.3481 12.6543 8.1203 1.0377 1.0959 1.0998
irintensity: 2.7307 0.1914 1.7485 1.6911 1.3020 0.0557 0.0410 0.3732 0.9921 0.0773 0.2940 0.9052 6.6420 0.2135 1.3544 14.1503 0.0474 7.0961 120.4241 16.6066 1.0930 22.2373 10.0879 114.1781 3.3609 42.7778 120.2189 36.8284 70.8355 50.1111 2.9955 16.6136 48.3903 217.5264 212.5106 20.3842 1.1622 4.7308 5.6728
temp: 298.150 k
press: 1.00000 atm
elementType: 17 17 17 8 8 6 6 6 6 6 6 6 1 1 1
symmnumber: 1
zpe: 213608.5 jmol-1
zpe.correction: 0.081359 hartree
zpe.thermalcorrener: 0.093247 hartree
zpe.thermalcorrenthalpy: 0.094191 hartree
zpe.thermalcorrgfe: 0.041459 hartree
zpe.sumelectzpe: -1798.271265 hartree
zpe.sumelectthermal: -1798.259377 hartree
zpe.sumelectthermalent: -1798.258433 hartree
zpe.sumelectthermalfe: -1798.311165 hartree
dipole: -1.1713 1.5762 -0.0018
dipole: 1.9638
quadrupole: -85.7428 -100.5168 -86.7157
quadrupole: -8.5301 0.0001 0.0020
quadrupole: 5.2490 -9.5250 4.2760 -8.5301 0.0001 0.0020
hfenergy: -1798.3526247 hartree
pointgroup: C01 [X(C7H3Cl3O2)]
dipole: 0.5345963 0.5578086 0.0006973 debye
dipolederiv: -0.6632911 0.32861 -0.0000289 0.2716439 -0.1836232 0.0000391 0.0000175 0.0000071 0.0014688 -0.5734663 0.3642099 -0.0000503 0.2646859 -0.1596794 0.0000089 -0.0000979 0.0000521 0.0291229 -0.4420103 -0.4052949 0.0000249 -0.3280398 -0.2871417 0.0000382 -0.0000006 -0.0000187 0.0326107 -0.5117292 0.017954 0.0000294 0.0262047 -0.9811411 -0.0001465 -0.0000243 0.0002351 -0.2733371 -0.4396038 0.0497812 -0.0000162 0.0970475 -0.865356 0.000277 0.0000621 -0.0003257 -0.2760853 -0.4031242 0.6265778 -0.000083 0.5965445 0.0174995 -0.0000948 0.0000981 0.0000964 0.0296896 0.6032935 -0.8235708 0.0000929 -0.9125893 0.0797053 -0.0000406 0.0002278 -0.0001242 -0.0991229 1.1094079 0.0279336 -0.0000411 0.1488305 1.1078611 0.0001479 0.000016 -0.0000594 0.2053084 0.3926219 -0.9682919 0.0001417 -0.952955 -0.0434145 -0.0000719 -0.0000133 0.0000351 -0.0429957 0.8969919 -0.0583461 -0.0000004 -0.0452594 0.967007 -0.0001117 -0.0000193 0.0002429 0.3047264 0.0091708 0.9484808 -0.00007 0.9016257 0.3248588 -0.0000422 -0.0002566 -0.0001152 -0.0605993 -0.1275121 -0.1026641 0.0000269 -0.1755205 -0.2063032 0.0000583 -0.000022 -0.0000528 0.0215544 0.0915215 -0.0061916 0.0389192 -0.0033014 0.0804407 -0.0810106 0.0068606 -0.0733507 0.0050123 0.0915174 -0.0060727 -0.0389972 -0.0032432 0.080469 0.0810011 -0.0068962 0.0733799 0.0050301 -0.0337879 0.0068849 0.000052 0.1143258 0.0688175 -0.0000522 0.0000482 -0.000002 0.1176167 unknown
polarizability: 140.016416|-8.7840835|160.6695345|0.0009745|-0.0048432|44.6996131 unknown
InChI: InChI=1S/C7H3Cl3O2/c1-2-3(8)7(12)5(10)4(9)6(2)11/h1H3
charge 0 multiplicity 1
15 atoms
Cl 2.937934 -1.364145 0.000038
Cl -2.920575 1.36918 -0.000265
Cl -2.590652 -1.913569 0.000065
O  -0.253192 2.721132 -0.00038
O  0.287441 -2.712137 -0.000609
C  1.241003 0.835692 -0.000062
C  1.346216 -0.531144 0.00013
C  -0.127055 1.464598 0.000284
C  -1.328357 0.559429 0.000084
C  0.162414 -1.459028 0.000553
C  -1.193049 -0.80322 0.000201
C  2.397328 1.799543 -0.000495
H  2.342269 2.461947 0.882284
H  2.341572 2.46187 -0.883286
H  3.365104 1.275451 -0.000842
