program: Gaussian 09
title: 000138300
version: EM64L-G09RevD.01
frameworkgroup: C1[X(C9H8FNO)]
method: RPBEPBE
basis: SDD
operation: Freq
keyword: #p
keyword: freq=noraman
keyword: PBEPBE/SDD
title: #p freq=noraman PBEPBE/SDD
converged: YES YES NO NO
title: Mulliken charges:
elementType: F O N C C C C C C C C C H H H H H H H H
charge: -0.205105 -0.229403 -0.425646 -0.541349 0.384940 -0.482922 0.328056 0.090007 -0.382521 -0.553825 -0.401338 0.356140 0.237358 0.235580 0.251678 0.248485 0.328193 0.241283 0.261638 0.258750
chargesum: 0.00000
title: Mulliken charges with hydrogens summed into heavy atoms:
elementType: F O N C C C C C C C C C
charge: -0.205105 -0.229403 -0.097453 -0.068410 0.384940 0.017241 0.328056 0.090007 -0.141238 -0.292187 -0.142588 0.356140
polarizability: 1.54387296e+02 6.40505845e+00 1.07821591e+02 1.40416693e+00 1.09610289e+00 5.22919239e+01
1716.lowfreq: -10.7623 -5.2130 -0.0008 0.0003 0.0007 6.9394 89.7414 112.9452 178.5666
frequency: 89.7394 112.9420 178.5666 237.5955 263.3198 329.5157 375.8880 401.7128 438.7769 445.3455 479.5801 515.3665 583.0521 599.9039 656.6015 699.2916 711.5675 730.8955 766.2108 801.2192 809.6928 857.4277 915.6808 939.6908 958.2063 1000.4561 1035.7934 1111.0563 1141.7532 1162.7245 1190.0161 1202.7642 1248.1000 1281.5328 1308.8701 1314.9599 1345.0778 1358.8890 1404.2157 1449.8507 1459.7980 1469.2506 1503.1568 1607.3353 1624.1365 1641.7853 2970.2545 2993.3264 3053.2630 3092.5198 3137.8530 3160.8119 3184.6683 3519.4899
redmass: 7.3079 3.8823 3.0957 5.3723 6.0898 3.0808 6.5221 7.7327 4.1845 3.1473 4.8240 2.8037 2.7067 4.1828 4.4671 2.3501 1.9321 4.3555 2.6569 3.6708 1.4453 1.6637 2.5254 1.3426 3.3117 2.1493 2.2601 1.4626 1.7517 1.1933 1.5740 2.7605 1.7214 1.8938 1.4959 2.6947 1.7013 2.5297 4.1856 1.0882 1.4168 2.1101 3.0446 8.1634 6.8200 6.0730 1.0676 1.0656 1.0950 1.0953 1.0903 1.0929 1.0955 1.0764
irintensity: 2.4236 0.7286 3.2484 1.5477 1.8566 5.5993 7.7978 1.0344 6.9161 5.8636 7.5479 9.8235 15.6025 4.6284 15.0486 29.0613 43.0951 4.1819 14.8693 16.5436 33.1517 71.5283 3.4691 0.3674 12.3436 7.5253 9.9476 13.6130 40.9038 5.5820 100.6542 9.5250 50.5035 4.1262 28.2106 137.7250 33.2170 0.3811 12.6279 13.0341 26.4691 28.2576 123.7138 62.2403 222.8940 314.8682 22.7213 16.5730 21.2789 12.7665 10.5851 0.9725 1.6186 25.3495
temp: 298.150 k
press: 1.00000 atm
elementType: 9 8 7 6 6 6 6 6 6 6 6 6 1 1 1 1 1 1 1 1
symmnumber: 1
zpe: 399980.4 jmol-1
zpe.correction: 0.152344 hartree
zpe.thermalcorrener: 0.161729 hartree
zpe.thermalcorrenthalpy: 0.162673 hartree
zpe.thermalcorrgfe: 0.117614 hartree
zpe.sumelectzpe: -576.748169 hartree
zpe.sumelectthermal: -576.738784 hartree
zpe.sumelectthermalent: -576.737840 hartree
zpe.sumelectthermalfe: -576.782899 hartree
dipole: 0.9897 2.6067 -0.0325
dipole: 2.7884
quadrupole: -89.1009 -60.9753 -70.1323
quadrupole: -4.4961 -0.6042 0.8326
quadrupole: -15.6981 12.4275 3.2706 -4.4961 -0.6042 0.8326
hfenergy: -576.900513 hartree
pointgroup: C01 [X(C9H8F1N1O1)]
dipole: -0.4111797 -1.0169352 -0.0166813 debye
dipolederiv: -0.9550475 0.3700515 0.0397389 0.4525177 -0.4443209 -0.0235826 0.0518114 -0.0186904 -0.1553338 -1.3420321 -0.2603762 -0.0282496 -0.4720313 -0.6648073 0.025173 0.0387319 0.0563351 -0.3655154 -1.7012544 -0.3116523 -0.0474219 0.1789934 -0.2803029 0.0242302 -0.1714447 -0.0036488 -0.359492 -0.0030352 -0.0035109 -0.0218979 0.0232057 0.1022314 -0.0113582 0.0180483 -0.0410156 0.1538466 -0.0611956 -0.1289841 -0.0504992 -0.4503576 -0.1587759 0.0096961 -0.0849171 0.0478589 -0.0898789 0.0424705 -0.0195724 -0.0118553 0.020187 -0.2343505 0.089014 0.0184687 0.1132593 0.0940283 1.0445096 0.3537189 -0.0298251 0.6451005 0.3220612 0.0156944 -0.0532764 -0.0068572 0.107417 2.1336134 0.2837671 0.1050458 -0.1907332 0.7389075 -0.1892372 0.1426842 -0.1778445 0.2276426 0.2153767 0.0516327 -0.0171835 0.0395464 0.1449212 0.012127 0.0107532 0.0079317 -0.1307252 -0.5153105 -0.0577556 -0.0045357 0.004728 -0.0573034 0.0061107 0.0037288 -0.006313 -0.210914 -0.267172 0.013848 -0.0100844 0.218654 -0.25827 -0.0177891 0.0127559 -0.0093665 -0.1907258 1.106257 -0.2935274 -0.0442773 -0.4758803 0.6309856 0.0235413 -0.0737151 0.0150515 0.1043036 0.0438943 -0.0612654 0.0071439 0.0073033 -0.132312 0.0487735 -0.0178105 0.0781374 0.0751387 -0.0166511 0.0546997 0.0457334 0.015993 0.0836269 -0.0058686 0.0530071 -0.0574723 -0.1153145 -0.095377 0.0671502 0.0162123 0.0334151 0.0600188 -0.0128916 0.0382678 -0.0293049 0.1038707 0.1118833 -0.0327735 0.0446043 -0.0160354 0.0515458 -0.0154639 -0.0209749 -0.0057595 -0.0962188 0.102813 0.0234339 -0.0159503 0.0352728 0.1525931 0.0269086 0.0245016 0.0346052 0.3181131 0.0865136 0.0299585 0.0030514 -0.0084792 -0.0931049 -0.0035357 -0.0050255 -0.0004225 0.1455896 0.091589 -0.0302945 0.0084295 -0.0066183 -0.0393782 -0.0047954 0.0060601 -0.0035049 0.1934 -0.0218449 -0.0485481 0.0118207 -0.0547817 0.0760344 0.0032535 0.0083452 0.0070211 0.1907682 unknown
polarizability: 154.6439538|5.4104322|107.5754451|-1.2454667|-0.8806239|52.2814121 unknown
InChI: InChI=1S/C9H8FNO/c10-7-3-1-6-2-4-9(12)11-8(6)5-7/h1,3,5,11H,2,4H2
charge 0 multiplicity 1
20 atoms
F  -3.627448 1.195968 0.120298
O  3.540423 1.238359 -0.00016
N  1.230008 1.12878 -0.166099
C  1.306246 -1.694881 -0.269096
C  -0.023043 -0.974993 -0.108657
C  2.44458 -0.931017 0.447007
C  -0.012854 0.450003 -0.088803
C  2.484371 0.549093 0.068251
C  -1.261656 -1.644204 -0.02933
C  -1.220867 1.184191 -0.014508
C  -2.485168 -0.938094 0.047725
C  -2.424043 0.464616 0.047184
H  1.239726 -2.726697 0.11886
H  1.551716 -1.776667 -1.348345
H  3.434054 -1.358207 0.217383
H  2.307591 -0.987163 1.545726
H  1.236701 2.138339 -0.338975
H  -1.276381 -2.739931 -0.039583
H  -1.235272 2.278501 0.006735
H  -3.449282 -1.449393 0.104687
