program: Gaussian 09
title: 000138299
version: EM64L-G09RevD.01
frameworkgroup: C1[X(C16H22)]
method: RPBEPBE
basis: SDD
operation: Freq
keyword: #p
keyword: freq=noraman
keyword: PBEPBE/SDD
title: #p freq=noraman PBEPBE/SDD
converged: YES YES NO NO
title: Mulliken charges:
elementType: C C C C C C C C C C C C C C C C H H H H H H H H H H H H H H H H H H H H H H
charge: -0.364455 -0.358068 -0.367470 -0.365884 -0.376317 -0.379821 -0.489324 -0.499499 -0.511297 -0.516426 -0.021992 -0.026542 0.242956 0.241624 -0.553997 -0.548384 0.244996 0.180106 0.238250 0.194649 0.195927 0.210706 0.192489 0.209052 0.191795 0.237784 0.199234 0.205495 0.229739 0.223553 0.229949 0.228488 0.223866 0.232864 0.248417 0.228367 0.274420 0.274749
chargesum: 0.00000
title: Mulliken charges with hydrogens summed into heavy atoms:
elementType: C C C C C C C C C C C C C C C C
charge: 0.060647 0.074831 0.039163 0.035658 0.053262 0.024907 -0.036032 -0.041062 -0.054566 -0.039642 -0.021992 -0.026542 0.242956 0.241624 -0.279578 -0.273635
polarizability: 1.77018088e+02 1.23670796e+01 1.50762412e+02 3.05381298e+01 1.26497990e+01 1.50036801e+02
1716.lowfreq: -9.9929 -0.0006 -0.0006 -0.0005 4.6958 9.6963 26.8593 33.3205 36.3746
frequency: 26.6513 33.2253 36.3086 47.2167 51.8395 60.8350 88.6678 117.9330 122.4865 126.4678 154.2383 168.8842 190.5215 203.4415 208.6838 245.0228 302.4123 326.7324 328.9052 342.8004 348.5736 357.8570 363.1540 490.9738 536.8529 544.4103 558.6664 625.9009 630.8193 633.6016 635.8059 676.6957 736.5956 743.0534 792.6540 809.0482 821.9205 837.3377 867.1022 870.3477 905.8931 926.4897 947.9311 977.2545 1019.3531 1029.9526 1064.0392 1069.2475 1081.5819 1083.6596 1085.6096 1088.1913 1135.4728 1141.5374 1161.2197 1184.7204 1187.2292 1220.6825 1222.6386 1259.0643 1262.7521 1281.5392 1282.5152 1290.3730 1294.4200 1314.3107 1317.7890 1322.7512 1325.0122 1341.2381 1345.0999 1363.5346 1366.3791 1453.3455 1455.3484 1457.6129 1458.7971 1461.7339 1463.5764 1464.5008 1469.2390 1480.5960 1485.4866 2131.5921 2133.0055 2273.7166 2960.9737 2963.1236 2965.7636 2966.5262 2968.5269 2969.8787 2972.3419 2972.8308 2977.0419 2977.6459 3011.7186 3012.9670 3018.2382 3018.9393 3023.6469 3025.1160 3033.8330 3034.9475 3054.2819 3055.6261 3424.6647 3424.8542
redmass: 4.3261 4.0838 4.3258 3.9328 4.1456 4.1607 3.8964 1.9044 3.1955 2.1341 2.7470 2.3806 2.7838 2.5838 2.9119 2.3567 3.7083 3.5982 3.4864 2.8431 2.8869 3.5165 3.1831 3.2684 3.3242 3.5374 3.6285 1.2343 1.2247 1.2238 1.2143 2.1818 1.1987 1.2342 1.7311 1.9470 1.7531 1.7227 2.2353 2.1795 2.0137 1.6792 2.0487 2.7107 2.6315 2.4580 2.5542 2.9450 2.3642 2.0634 2.0886 2.0592 1.3306 1.2227 2.2527 1.1715 1.1563 1.2678 1.2579 1.3153 1.3343 1.2157 1.2045 1.1251 1.1120 1.3000 1.4132 1.2961 1.3141 1.4003 1.3696 1.5702 1.5625 1.0883 1.0843 1.0830 1.0868 1.0725 1.0798 1.0871 1.0757 1.0966 1.0972 6.0677 6.0561 11.6685 1.0630 1.0592 1.0591 1.0622 1.0597 1.0597 1.0615 1.0616 1.0624 1.0626 1.0975 1.0970 1.0975 1.0969 1.0972 1.0983 1.1028 1.1026 1.1038 1.1037 1.1575 1.1577
irintensity: 0.1953 0.4556 0.1680 0.1548 1.3210 0.0061 0.1015 0.4647 1.9322 0.2157 1.3326 0.3789 0.1490 1.7750 1.8552 9.8562 1.2570 2.6749 16.3000 2.5626 2.5028 0.3563 0.1819 7.2388 1.4728 0.9909 0.6693 50.8507 82.1406 86.7596 116.7771 1.1863 7.3616 9.1129 1.1590 2.5498 0.8892 1.4817 0.8362 3.7167 0.3302 1.2479 0.1331 2.8640 0.8363 0.2557 0.6986 1.3129 0.0762 1.0640 0.5319 0.7683 0.3863 0.1157 0.1941 0.3375 4.3618 3.0068 0.2839 0.9930 0.7227 0.0871 0.1459 3.7023 4.2636 3.9772 1.7884 5.2825 8.1411 5.9674 6.4721 2.0584 2.4494 14.8193 8.2633 5.3643 8.6594 0.5053 5.6172 0.2868 1.2070 18.6096 10.7306 1.6322 16.2549 1.3194 12.2765 18.6003 30.6776 14.3438 23.4936 11.3909 32.9883 32.2593 126.2226 51.5612 19.8692 14.3723 7.6591 25.1387 27.4944 32.9067 4.5892 5.1382 107.6546 80.4223 29.2474 73.1816
temp: 298.150 k
press: 1.00000 atm
elementType: 6 6 6 6 6 6 6 6 6 6 6 6 6 6 6 6 1 1 1 1 1 1 1 1 1 1 1 1 1 1 1 1 1 1 1 1 1 1
symmnumber: 1
zpe: 855247.2 jmol-1
zpe.correction: 0.325746 hartree
zpe.thermalcorrener: 0.345428 hartree
zpe.thermalcorrenthalpy: 0.346373 hartree
zpe.thermalcorrgfe: 0.275664 hartree
zpe.sumelectzpe: -621.487002 hartree
zpe.sumelectthermal: -621.467320 hartree
zpe.sumelectthermalent: -621.466376 hartree
zpe.sumelectthermalfe: -621.537084 hartree
dipole: 0.1634 -0.1435 -0.0493
dipole: 0.2230
quadrupole: -87.6829 -100.7701 -96.6001
quadrupole: 6.0403 7.5466 3.9071
quadrupole: 7.3348 -5.7524 -1.5824 6.0403 7.5466 3.9071
hfenergy: -621.8127485 hartree
pointgroup: C01 [X(C16H22)]
dipole: 0.0594286 -0.0624564 -0.016209 debye
polarizability: 175.1018734|8.5936451|148.3871743|33.3147239|10.0686747|154.3282536 unknown
InChI: InChI=1S/C16H22/c1-3-5-7-9-11-13-15-16-14-12-10-8-6-4-2/h1-2H,5-14H2
charge 0 multiplicity 1
38 atoms
C  2.155642 0.998448 0.143149
C  -2.049804 -0.263389 -0.467724
C  1.706895 1.855351 1.347553
C  -3.075283 0.882616 -0.606762
C  2.704247 -0.380333 0.568602
C  -2.690123 -1.597793 -0.029257
C  1.004243 3.183175 0.930941
C  -2.458886 2.190162 -1.18997
C  3.200506 -1.2463 -0.625722
C  -1.634763 -2.680925 0.345138
C  -0.244017 2.939925 0.180829
C  -1.267604 2.644268 -0.445138
C  2.147085 -1.593412 -1.600342
C  -0.90729 -2.376043 1.59256
C  1.278891 -1.900399 -2.422748
C  -0.313403 -2.122609 2.64493
H  1.29534 0.85406 -0.537663
H  2.929245 1.547361 -0.434487
H  -1.281064 0.034818 0.270059
H  -1.515502 -0.409493 -1.429533
H  2.582228 2.104948 1.981413
H  1.008834 1.266549 1.975266
H  -3.910385 0.571051 -1.267303
H  -3.514023 1.099977 0.386976
H  3.556284 -0.247415 1.266526
H  1.918605 -0.936387 1.115952
H  -3.324962 -1.996479 -0.846205
H  -3.354788 -1.429047 0.840696
H  0.786245 3.782901 1.836985
H  1.699883 3.787773 0.313789
H  -3.228808 2.987043 -1.200744
H  -2.17515 2.013448 -2.247761
H  4.011044 -0.706683 -1.156391
H  3.646163 -2.183692 -0.23786
H  -0.902154 -2.782241 -0.481102
H  -2.132535 -3.664464 0.456401
H  0.537557 -2.15925 -3.156042
H  0.193209 -1.910922 3.568488
