program: Gaussian 09
title: 000138298
version: EM64L-G09RevD.01
frameworkgroup: C1[X(C3H6O3P2)]
method: RPBEPBE
basis: SDD
operation: Freq
keyword: #pfreq=noraman
keyword: PBEPBE/SDD
title: #p freq=noraman PBEPBE/SDD
converged: YES YES NO NO
title: Mulliken charges:
elementType: P P O O O C C C H H H H H H
charge: 0.502685 1.085991 -0.504561 -0.504330 -0.504356 -0.564894 -0.565488 -0.565287 0.265684 0.274357 0.265785 0.274343 0.265699 0.274372
chargesum: 0.00000
title: Mulliken charges with hydrogens summed into heavy atoms:
elementType: P P O O O C C C
charge: 0.502685 1.085991 -0.504561 -0.504330 -0.504356 -0.024853 -0.025360 -0.025216
polarizability: 8.11318611e+01 1.97609657e-03 7.75965029e+01 3.73477399e-04 -8.21481962e-04 7.75815834e+01
1716.lowfreq: -0.0028 -0.0025 -0.0018 5.7581 19.8530 25.6170 138.4071 209.4812 211.7947
frequency: 138.3835 209.4773 211.7877 276.5753 277.0301 380.5036 381.2329 392.5540 530.2802 549.3355 551.5128 611.8019 652.3129 653.9431 663.1246 809.3021 852.4374 853.0427 910.4056 910.6324 962.0625 1178.5392 1192.0857 1193.1922 1278.3450 1279.3594 1302.8035 1415.1708 1415.8560 1423.5367 3012.3451 3014.0194 3014.1331 3106.2403 3107.0427 3107.6470
redmass: 2.9679 2.1742 2.1696 9.6516 9.5786 7.8115 7.8385 16.3875 9.3122 11.8327 11.8501 8.1746 5.9001 5.9099 4.4344 1.5331 3.7676 3.6873 2.1952 2.2081 11.0933 1.0813 1.0541 1.0541 1.1757 1.1757 1.1614 1.0723 1.0724 1.0708 1.0601 1.0592 1.0593 1.1045 1.1047 1.1048
irintensity: 7.8701 5.9316 5.8028 13.1537 13.1443 0.7509 0.6876 1.3246 8.2014 59.3324 60.0425 5.9474 22.3990 21.8217 54.8979 28.5294 8.2758 8.0689 12.2035 12.1628 196.6342 0.1171 0.9291 0.9173 0.6102 0.6044 0.0854 4.2065 4.1916 2.8582 11.6394 47.0123 46.8069 4.6159 6.3902 7.0961
temp: 298.150 k
press: 1.00000 atm
elementType: 15 15 8 8 8 6 6 6 1 1 1 1 1 1
symmnumber: 1
zpe: 250127.5 jmol-1
zpe.correction: 0.095269 hartree
zpe.thermalcorrener: 0.103316 hartree
zpe.thermalcorrenthalpy: 0.104261 hartree
zpe.thermalcorrgfe: 0.062897 hartree
zpe.sumelectzpe: -1025.400869 hartree
zpe.sumelectthermal: -1025.392821 hartree
zpe.sumelectthermalent: -1025.391877 hartree
zpe.sumelectthermalfe: -1025.433240 hartree
dipole: 2.3863 0.0034 0.0004
dipole: 2.3863
quadrupole: -64.5522 -61.4323 -61.4312
quadrupole: 0.0013 0.0005 -0.0004
quadrupole: -2.0803 1.0396 1.0406 0.0013 0.0005 -0.0004
hfenergy: -1025.4961374 hartree
pointgroup: C01 [X(C3H6O3P2)]
dipole: 0.9388429 0.0006106 -0.001404 debye
dipolederiv: 0.1545622 -0.000274 0.000199 -0.0001777 0.0896325 0.002504 0.0002029 -0.0022773 0.0903009 1.3879919 -0.0000885 -0.0000529 -0.0003517 1.0528467 -0.0510866 0.00029 0.0507829 1.052891 -0.9950095 -0.0376582 0.1958871 0.052018 -0.4063547 0.0758994 0.0608083 0.0268566 -0.7212158 -0.9943148 0.1886659 -0.0651735 0.0267093 -0.6866639 0.1351458 -0.075142 0.0859117 -0.4402697 -0.9947425 -0.1506098 -0.1303787 -0.0785419 -0.5976546 -0.1369733 0.014549 -0.1866052 -0.5292785 0.4556927 -0.0200068 -0.1658368 -0.1421608 0.1140246 0.083768 0.0889032 0.031641 0.2888171 0.4554762 -0.1337752 0.0999289 0.148437 0.1949054 -0.078733 0.0781916 -0.1304276 0.2074048 0.4555375 0.1533853 0.0653262 -0.0059951 0.29522 0.0728854 -0.1678656 0.0211291 0.1075647 0.022302 -0.0076723 0.0109511 0.0541108 -0.0373413 -0.1382404 -0.0038849 -0.0577296 -0.0260339 0.0025697 -0.0285753 0.0806853 -0.038035 0.0091217 0.0850553 0.0392115 0.073398 0.0167334 0.0224323 0.0132896 0.001013 -0.0304768 0.0562484 0.0037068 -0.0450957 0.0843058 -0.1193653 0.0025223 0.0842518 -0.0154035 0.0528622 -0.0538165 -0.0371609 0.0134626 -0.0489253 0.0797833 0.0224176 -0.0055392 -0.0119424 -0.0236232 -0.1138013 0.0137162 0.0489782 0.0941468 0.0503551 0.0025624 -0.0553933 -0.0652029 -0.0147751 0.0836329 -0.0304867 -0.052609 -0.0422069 -0.057687 unknown
polarizability: 81.1318602|0.0008873|77.5833971|-0.0025429|-0.0049444|77.5946902 unknown
InChI: InChI=1S/C3H6O3P2/c1-4-8-5-2-7(1)3-6-8/h1-3H2
charge 0 multiplicity 1
14 atoms
P  1.708524 -0.001085 -0.000081
P  -1.566632 0.000652 0.000072
O  -0.707979 0.741225 -1.372729
O  -0.709246 -1.559414 0.045116
O  -0.707443 0.818004 1.328724
C  0.696631 0.326453 -1.614238
C  0.695319 -1.560828 0.524235
C  0.696953 1.234081 1.089461
H  0.707374 -0.600942 -2.216169
H  1.155799 1.147572 -2.185717
H  0.706749 -1.618254 1.62836
H  1.154583 -2.466519 0.099279
H  0.708082 2.21907 0.587238
H  1.156688 1.318687 2.08605
