program: Gaussian 09
title: 000138297
version: EM64L-G09RevD.01
frameworkgroup: C1[X(C8H14O)]
method: RPBEPBE
basis: SDD
operation: Freq
keyword: #pfreq=noraman
keyword: PBEPBE/SDD
title: #p freq=noraman PBEPBE/SDD
converged: YES YES NO NO
title: Mulliken charges:
elementType: O C C C C C C C C H H H H H H H H H H H H H H
charge: -0.196669 0.260926 -0.480010 -0.116382 -0.481447 0.087907 -0.737118 -0.732797 -0.721690 0.220770 0.208894 0.236267 0.227592 0.207165 0.212859 0.239784 0.211634 0.241316 0.220384 0.218760 0.214451 0.212384 0.245022
chargesum: 0.00000
title: Mulliken charges with hydrogens summed into heavy atoms:
elementType: O C C C C C C C C
charge: -0.196669 0.260926 -0.050346 0.119885 -0.046690 0.087907 -0.072842 -0.052337 -0.049834
polarizability: 9.34153643e+01 2.66633011e-01 8.50220265e+01 -5.09225258e-01 -4.13561820e-01 7.41061083e+01
1716.lowfreq: -17.9520 -6.0835 -0.0008 -0.0008 -0.0006 14.5777 53.9785 165.9289 184.6945
frequency: 53.8077 165.8758 184.6854 192.7716 207.9353 225.5714 251.8792 283.2791 329.1645 345.8065 382.9817 493.7136 520.0907 570.1590 652.3995 714.7254 790.2078 855.5563 892.2137 924.3710 943.6278 950.7018 973.1862 991.1688 998.0137 1046.5238 1081.2538 1106.4758 1148.6080 1181.7618 1214.9786 1226.3862 1240.5587 1264.8537 1274.8898 1300.8146 1319.3933 1367.9063 1386.0821 1389.5267 1457.5167 1466.3490 1471.3162 1474.2924 1476.3522 1477.4791 1482.0668 1488.4532 1649.4405 2934.5954 2975.1779 2976.9170 2983.3828 2989.0272 2995.7507 3056.3611 3067.6630 3070.7476 3073.9546 3079.1010 3082.5117 3087.1436 3089.8104
redmass: 3.5492 2.3084 1.1652 1.1924 1.6817 1.9082 1.3568 3.0979 2.4537 2.2225 2.1507 3.3227 3.6621 2.9246 4.8286 2.7825 2.0501 2.0473 2.2586 1.5896 1.3453 1.5938 1.6759 1.5920 1.6985 1.4889 1.7871 1.8650 2.1383 1.8730 2.2786 2.3613 2.0448 1.5022 1.4557 1.4286 1.7779 1.1870 1.2014 1.2031 1.0554 1.0518 1.0528 1.0627 1.0733 1.0589 1.0647 1.0671 11.3283 1.0805 1.0347 1.0353 1.0358 1.0621 1.0638 1.0990 1.1017 1.1015 1.0990 1.1000 1.1002 1.0997 1.0998
irintensity: 2.2888 0.5924 0.6326 0.2950 1.3801 1.5403 1.7074 4.9014 1.2782 0.0864 0.3652 2.6481 2.2417 1.0395 0.4725 4.0322 2.5681 2.5391 12.4067 9.1138 0.7833 1.0757 24.0713 5.5900 25.7489 3.5985 18.5248 9.5218 9.1654 4.8304 1.9902 7.7087 10.3280 5.4558 2.4626 1.3910 1.9442 16.7544 12.2110 18.4925 2.6085 2.6979 4.9137 21.9332 3.2410 8.8384 23.6397 12.0512 124.0239 10.5211 31.9433 22.2697 30.3848 38.0466 36.0150 24.9449 8.9921 35.3424 54.1918 47.8090 15.3035 29.8976 22.2751
temp: 298.150 k
press: 1.00000 atm
elementType: 8 6 6 6 6 6 6 6 6 1 1 1 1 1 1 1 1 1 1 1 1 1 1
symmnumber: 1
zpe: 528446.3 jmol-1
zpe.correction: 0.201275 hartree
zpe.thermalcorrener: 0.211375 hartree
zpe.thermalcorrenthalpy: 0.212319 hartree
zpe.thermalcorrgfe: 0.166744 hartree
zpe.sumelectzpe: -387.753568 hartree
zpe.sumelectthermal: -387.743468 hartree
zpe.sumelectthermalent: -387.742524 hartree
zpe.sumelectthermalfe: -387.788099 hartree
dipole: -0.1179 3.0301 -0.0880
dipole: 3.0337
quadrupole: -53.6947 -63.3723 -54.3672
quadrupole: 0.8258 -0.8024 -0.4200
quadrupole: 3.4501 -6.2276 2.7775 0.8258 -0.8024 -0.4200
hfenergy: -387.954843 hartree
pointgroup: C01 [X(C8H14O1)]
dipole: -0.0443625 -1.1918763 0.0446931 debye
dipolederiv: -0.544867 -0.0167852 -0.0225517 -0.034849 -0.9509761 -0.0181232 -0.0196552 0.0317307 -0.3110871 -0.2947832 -0.1556144 -0.0837469 -0.1198202 -0.0179626 -0.0324776 -0.1160022 -0.0652137 0.0408078 -0.0106542 0.018534 0.0436226 0.0420021 0.0473335 0.0311966 -0.008252 -0.0099992 0.1052599 -0.3051377 0.171882 -0.081996 0.1260154 -0.0770202 0.0375149 -0.0880081 0.1059749 0.1586827 -0.03838 -0.0180505 0.0430977 -0.037559 0.0585534 -0.04115 0.0244857 0.007529 0.1422304 0.9794169 0.0127335 0.1888322 0.0315593 0.9207457 0.0219822 0.1911583 -0.0640046 0.055242 0.0434716 0.0518575 0.0316665 0.0011527 -0.0061931 -0.0037513 -0.0035865 -0.0156039 0.0357653 0.0412249 -0.0059351 -0.0132113 -0.0276215 0.0125382 -0.0112892 0.0745446 0.0515086 -0.0030358 0.0469786 -0.0606124 0.0353019 -0.007063 -0.016651 0.0175812 0.0120034 -0.0045025 0.0777997 -0.0430838 -0.1183101 -0.0395833 -0.0942906 -0.0648258 -0.0516893 -0.0605476 -0.0994285 0.0414704 0.0431107 0.0106045 0.0104934 0.0180856 0.0574811 0.0153952 0.0437244 0.0688281 -0.1794971 0.0686925 0.0132099 0.0248789 0.0119493 0.04591 -0.0103848 0.0060875 -0.0268557 -0.1236174 -0.0218758 0.1164146 -0.0457786 0.098551 -0.0802116 0.0563539 -0.0648271 0.0950402 0.0388312 0.0562568 -0.0134149 0.0268227 -0.0208813 0.059003 -0.003288 0.0528969 -0.0632052 -0.1623991 0.0589317 0.0139189 -0.0773821 0.010824 0.0898138 0.025804 -0.0150585 0.00214 -0.1643016 0.0755024 0.0321178 0.0052138 0.1013558 -0.0990644 0.0277479 -0.0118047 0.0628578 0.0789605 -0.1205653 -0.0910835 0.0032936 -0.1282948 0.0201949 -0.0237071 -0.0288967 -0.038935 0.0744506 0.0797575 0.0348672 -0.0320671 0.0708655 -0.0977805 0.0891514 -0.0211924 0.0313109 0.0597298 -0.0342049 0.0696938 0.1311331 0.0608289 0.0585379 -0.0722689 0.0954947 -0.0457152 -0.0152878 -0.0963273 -0.111093 -0.063391 -0.1190206 0.0225656 -0.0218047 -0.0382982 -0.0108426 0.0541803 -0.1222008 0.0899391 -0.0287449 0.1340276 0.0239741 0.040928 -0.0389343 0.0467356 0.0680317 0.0554676 -0.0132711 -0.0614095 -0.0090698 0.0893373 -0.0330673 0.0170172 -0.0119383 -0.1519877 0.0832687 -0.0316024 0.0055059 -0.1087475 -0.0953032 -0.0406537 -0.0023492 -0.0474114 0.0797711 unknown
polarizability: 93.4290375|-0.2663549|85.0146471|0.0807137|-0.4902753|74.0998144 unknown
InChI: InChI=1S/C8H14O/c1-6-4-5-8(2,3)7(6)9/h6H,4-5H2,1-3H3
charge 0 multiplicity 1
23 atoms
O  0.213789 1.988862 0.068112
C  -1.089066 -0.131022 -0.017239
C  -0.595492 -1.556608 0.368244
C  1.419142 -0.164419 0.369322
C  0.913043 -1.579844 -0.010496
C  0.188677 0.735693 0.13815
C  -2.237259 0.406009 0.865725
C  -1.504836 -0.067394 -1.518965
C  2.692199 0.340221 -0.333737
H  -1.173863 -2.349329 -0.138774
H  -0.708559 -1.708545 1.45987
H  1.589482 -0.142909 1.470261
H  1.466797 -2.381326 0.508409
H  1.03953 -1.741543 -1.09873
H  -1.977935 0.35379 1.93936
H  -2.448831 1.461486 0.617738
H  -3.158623 -0.184533 0.706261
H  -1.709101 0.9764 -1.816336
H  -0.717405 -0.467026 -2.184114
H  -2.421578 -0.665455 -1.675682
H  3.572475 -0.261084 -0.043785
H  2.582708 0.281576 -1.43237
H  2.882608 1.3954 -0.070124
