program: Gaussian 09
title: 000138295
version: EM64L-G09RevD.01
frameworkgroup: C1[X(C10H10)]
method: RPBEPBE
basis: SDD
operation: Freq
keyword: #p
keyword: freq=noraman
keyword: PBEPBE/SDD
title: #p freq=noraman PBEPBE/SDD
converged: NO YES NO YES
title: Mulliken charges:
elementType: C C C C C C C C C C H H H H H H H H H H
charge: -0.258511 -0.258515 -0.258480 -0.258445 -0.258480 -0.258442 -0.258510 -0.258418 -0.258510 -0.258422 0.258483 0.258483 0.258494 0.258508 0.258495 0.258508 0.258482 0.258398 0.258482 0.258399
chargesum: 0.00000
title: Mulliken charges with hydrogens summed into heavy atoms:
elementType: C C C C C C C C C C
charge: -0.000029 -0.000031 0.000015 0.000063 0.000015 0.000067 -0.000029 -0.000020 -0.000028 -0.000022
polarizability: 8.47940127e+01 1.87393806e-03 8.47680725e+01 1.95894089e-04 1.62207603e-04 8.24279305e+01
1716.lowfreq: -12.1524 -0.0007 -0.0004 0.0004 8.5662 28.7694 548.0094 549.6434 612.2586
frequency: 548.0071 549.6431 612.2456 614.5377 619.8099 628.8795 630.8671 755.3433 806.8146 808.4561 841.7389 842.5362 854.3183 864.4944 864.9744 871.8980 873.1542 890.8776 892.3329 941.2859 942.0668 942.5050 990.2984 990.4912 1072.5707 1073.1804 1084.8400 1111.0844 1111.9055 1124.2529 1125.2525 1163.8787 1164.4320 1167.9870 1168.4594 1194.3316 1199.8068 1201.1005 1211.3423 1218.9519 1248.7674 1249.3284 1259.3644 1260.3554 3052.6750 3052.9181 3067.0379 3067.3211 3067.6657 3068.0732 3082.7577 3085.9852 3086.3515 3110.3278
redmass: 3.0771 3.0717 4.9732 4.9762 2.9209 5.4260 5.3769 2.5234 1.9329 1.9186 1.9121 1.9034 3.4091 1.5390 1.5323 2.1136 2.1323 3.0843 2.9446 1.7502 1.8207 1.7758 1.2617 1.2597 2.3651 2.3710 2.6289 3.3821 3.4184 2.3275 2.3134 1.2574 1.2520 1.5083 1.4977 1.2256 1.9887 1.9944 1.3679 1.4568 1.8558 1.8628 1.6212 1.6249 1.0882 1.0882 1.0897 1.0898 1.0891 1.0892 1.0934 1.0965 1.0965 1.1030
irintensity: 0.0000 0.0001 0.0008 0.0002 0.0002 0.0002 0.0000 15.0864 0.0015 0.0000 0.0013 0.0003 0.0027 0.1709 0.0482 17.0031 17.0478 0.0026 0.0006 0.0000 0.0001 0.0000 0.0012 0.0007 2.2056 2.1195 0.0061 0.0016 0.0006 0.0000 0.0014 0.0000 0.0012 0.0014 0.0000 0.0006 0.0042 0.0015 0.0046 22.0609 0.0012 0.0001 9.4315 9.3451 0.0002 0.0129 0.0196 0.0175 0.0096 0.0209 151.9672 153.6266 153.6199 0.0126
temp: 298.150 k
press: 1.00000 atm
elementType: 6 6 6 6 6 6 6 6 6 6 1 1 1 1 1 1 1 1 1 1
symmnumber: 1
zpe: 438610.1 jmol-1
zpe.correction: 0.167058 hartree
zpe.thermalcorrener: 0.172414 hartree
zpe.thermalcorrenthalpy: 0.173358 hartree
zpe.thermalcorrgfe: 0.137619 hartree
zpe.sumelectzpe: -386.208098 hartree
zpe.sumelectthermal: -386.202741 hartree
zpe.sumelectthermalent: -386.201797 hartree
zpe.sumelectthermalfe: -386.237537 hartree
dipole: -0.0001 0.0004 0.0000
dipole: 0.0004
quadrupole: -57.2017 -57.2045 -58.3248
quadrupole: 0.0013 0.0001 0.0001
quadrupole: 0.3753 0.3725 -0.7478 0.0013 0.0001 0.0001
hfenergy: -386.3751555 hartree
pointgroup: C01 [X(C10H10)]
dipole: -0.0000053 0.0001579 -0.0000014 debye
dipolederiv: 0.0045477 0.0066425 0.010612 0.0065899 0.0590358 0.0868854 0.013268 0.1073095 0.0171776 0.0045557 0.006667 -0.0106157 0.0066091 0.0590237 -0.0868828 -0.0132712 -0.1073072 0.0171854 0.057679 0.0104062 0.085774 0.010565 0.0056482 0.0167359 0.1066522 0.0211274 0.0174173 0.0500641 -0.0216002 -0.079448 -0.0215699 0.0138951 0.0371663 -0.0990124 0.0463943 0.0167595 0.0577191 0.0104056 -0.0857637 0.0105655 0.0056462 -0.0167335 -0.106642 -0.0211235 0.0173748 0.0500245 -0.0215868 0.0794611 -0.0215554 0.013887 -0.0371729 0.0990256 -0.0464017 0.0168049 0.0172657 -0.0237625 0.0427358 -0.0238183 0.0467756 -0.0766047 0.0527755 -0.0949377 0.01704 0.0295206 0.0279046 -0.0593624 0.0280108 0.0337321 -0.0640741 -0.073579 -0.0796642 0.017244 0.017285 -0.0237841 -0.0427343 -0.0238382 0.0467837 0.0765974 -0.0527757 0.0949308 0.0170066 0.0294944 0.0278906 0.0593616 0.0279984 0.03374 0.0640774 0.0735772 0.0796677 0.0172666 0.0590236 -0.0222979 -0.0164085 -0.0223654 -0.1227068 -0.1353765 -0.0155739 -0.12895 -0.0170968 0.0590169 -0.0223258 0.0164264 -0.0223951 -0.1226911 0.135376 0.0155913 0.1289491 -0.0171036 -0.1183514 -0.0353033 -0.1337828 -0.035282 0.0549009 -0.026177 -0.1274334 -0.0249281 -0.0172442 -0.0922896 0.0716256 0.1236699 0.0715878 0.0284934 -0.0574945 0.1177026 -0.0548268 -0.0170156 -0.1184094 -0.0353009 0.1337612 -0.0352808 0.0549033 0.026165 0.1274126 0.0249155 -0.0171877 -0.0922358 0.0716056 -0.1236937 0.0715665 0.0285003 0.0575082 -0.1177269 0.0548413 -0.0170797 0.0174279 0.079663 -0.066395 0.0795344 -0.0812531 0.1192654 -0.0629815 0.113485 -0.0170276 -0.024888 -0.0932778 0.0927873 -0.093252 -0.0385203 0.0997722 0.0885632 0.0951117 -0.017254 0.0173984 0.0796918 0.0663983 0.0795641 -0.0812649 -0.1192433 0.0629858 -0.113464 -0.0169855 -0.0248485 -0.0932634 -0.0927836 -0.0932345 -0.038529 -0.0997899 -0.0885582 -0.0951291 -0.0172821 unknown
polarizability: 84.7915951|0.0077705|84.7704901|0.0002428|-0.0000758|82.4279305 unknown
InChI: InChI=1S/C10H10/c1-2-5-3(1)7-8-4(1)6(2)10(8)9(5)7/h1-10H
charge 0 multiplicity 1
20 atoms
C  0.16163 1.330692 0.796903
C  0.161811 1.330651 -0.796939
C  1.315728 0.257658 0.797044
C  -1.21577 0.564664 0.796664
C  1.31591 0.257615 -0.796762
C  -1.215581 0.564611 -0.796979
C  0.651419 -1.171344 0.796842
C  -0.913591 -0.981675 0.797155
C  0.651597 -1.171391 -0.796629
C  -0.913412 -0.981726 -0.797298
H  0.272189 2.242308 1.402325
H  0.272507 2.242234 -1.402383
H  2.21674 0.433941 1.402756
H  -2.048555 0.951983 1.401879
H  2.217056 0.433865 -1.402282
H  -2.048226 0.951889 -1.402414
H  1.097705 -1.974023 1.402129
H  -1.538793 -1.654033 1.40285
H  1.098019 -1.9741 -1.401774
H  -1.538484 -1.654118 -1.403086
