program: Gaussian 09
title: 000138294
version: EM64L-G09RevD.01
frameworkgroup: C1[X(C6H11Br)]
method: RPBEPBE
basis: SDD
operation: Freq
keyword: #pfreq=noraman
keyword: PBEPBE/SDD
title: #p freq=noraman PBEPBE/SDD
converged: YES YES NO NO
title: Mulliken charges:
elementType: Br C C C C C C H H H H H H H H H H H
charge: -0.065444 -0.314537 -0.423401 -0.471882 -0.650594 -0.027778 -0.587044 0.222712 0.245919 0.283653 0.213815 0.207558 0.247002 0.224767 0.239574 0.217583 0.219209 0.218887
chargesum: 0.00000
title: Mulliken charges with hydrogens summed into heavy atoms:
elementType: Br C C C C C C
charge: -0.065444 0.154094 -0.139748 -0.050509 0.060750 0.189806 -0.148948
polarizability: 1.14307205e+02 -1.05900708e+00 7.07168101e+01 7.74677643e+00 -2.23159882e-01 6.03940615e+01
1716.lowfreq: -27.4070 -13.8938 -11.8097 0.0005 0.0005 0.0006 49.4984 61.3012 100.4139
frequency: 49.3643 61.2783 100.3769 138.2168 225.8425 240.9809 280.8297 311.0918 398.1535 433.1415 577.5086 634.0341 770.2829 887.7292 916.9233 939.8295 948.9402 994.4981 1002.6699 1014.7023 1048.7685 1120.0160 1151.6727 1190.8937 1220.4991 1261.5390 1279.4767 1290.7112 1325.8753 1338.2010 1390.5260 1424.8405 1455.9043 1464.0039 1470.5011 1477.4134 1658.5198 2968.3706 2981.4158 2999.0707 3027.1563 3051.4886 3071.8100 3076.6029 3079.7690 3093.4260 3107.8278 3196.9573
redmass: 2.3372 3.1398 2.4318 2.7797 1.4856 2.8213 2.1856 2.5043 2.1144 2.1259 3.4211 1.5154 1.2277 2.4014 1.5215 1.4745 1.4591 1.3575 1.1231 3.3400 1.4680 2.0169 1.8884 1.5524 1.3404 1.2563 1.1570 1.2385 1.3250 1.4021 1.2185 1.1739 1.0763 1.0524 1.0818 1.0726 4.7326 1.0591 1.0384 1.0622 1.0983 1.0888 1.0978 1.0886 1.0841 1.0789 1.1006 1.1145
irintensity: 0.1391 0.1649 0.4973 0.9024 0.3885 4.4274 2.8982 2.0754 1.9921 3.4710 27.7632 21.5702 6.4595 3.7393 0.0347 25.7239 63.2451 15.3739 7.5941 0.4381 34.9448 10.1243 20.6640 27.0279 6.9876 18.4899 4.2141 3.1774 2.4477 4.4997 24.3112 3.7258 3.0823 10.4172 4.0147 18.2862 20.2233 20.8399 22.7878 15.1624 12.1265 3.8920 8.7395 12.3235 61.3880 6.4025 28.0300 28.9739
temp: 298.150 k
press: 1.00000 atm
elementType: 35 6 6 6 6 6 6 1 1 1 1 1 1 1 1 1 1 1
symmnumber: 1
zpe: 401644.1 jmol-1
zpe.correction: 0.152978 hartree
zpe.thermalcorrener: 0.162230 hartree
zpe.thermalcorrenthalpy: 0.163174 hartree
zpe.thermalcorrgfe: 0.116875 hartree
zpe.sumelectzpe: -248.103602 hartree
zpe.sumelectthermal: -248.094350 hartree
zpe.sumelectthermalent: -248.093406 hartree
zpe.sumelectthermalfe: -248.139705 hartree
dipole: -2.1290 1.6317 -0.2342
dipole: 2.6926
quadrupole: -58.5975 -53.5853 -51.7329
quadrupole: 2.3613 -0.0028 -0.4805
quadrupole: -3.9589 1.0532 2.9057 2.3613 -0.0028 -0.4805
hfenergy: -248.2565801 hartree
pointgroup: C01 [X(C6H11Br1)]
dipole: 0.7137612 -0.7777587 -0.0884427 debye
dipolederiv: -0.598552 0.2410163 0.0093221 0.3000428 -0.4474071 -0.0074666 0.0507185 -0.0493884 -0.1728939 -0.1627734 0.0063302 -0.0302688 0.0731981 -0.0645839 -0.0213585 0.0021606 -0.0881304 0.1151898 0.7776612 -0.3846542 -0.0517237 -0.3886337 0.6342385 0.0388797 -0.0215358 0.0753778 0.1567653 -0.1491249 -0.0027954 -0.0300412 -0.166771 0.1711388 -0.0561496 -0.1199866 0.0052833 0.1174542 -0.1212377 0.0659426 0.0057556 -0.0412277 -0.2087473 0.0477507 0.0100831 -0.0201232 0.0461044 0.2350452 0.1531663 -0.0060045 0.3049919 -0.1738534 0.0213816 0.1597476 0.0255403 0.1524349 -0.2660355 0.1229975 0.0640214 0.072727 -0.3567321 0.0591371 0.0591232 0.070692 0.0696328 0.0566576 0.0148537 0.0215413 -0.0013627 0.0758688 0.0066531 -0.0014897 -0.0186985 -0.136104 0.0510847 -0.038661 0.0133503 -0.04306 -0.0953673 0.0435523 0.0034786 0.0589356 0.058069 -0.033889 0.0543024 0.0659701 0.0414599 -0.0275799 -0.026089 0.0102907 -0.00716 -0.1122226 0.0380729 -0.0699809 0.0220955 -0.048153 -0.1361281 0.0582323 -0.0130691 0.0686414 0.0585237 0.0446056 0.0013433 0.0137361 0.0065054 0.072721 -0.0014055 -0.005147 -0.0472421 -0.1598553 -0.0892084 -0.0977299 -0.0677885 -0.0501208 0.0832756 -0.0107375 -0.0813467 -0.0180952 0.0645688 0.0236042 0.1185269 0.054398 0.160233 -0.0736467 -0.0269925 0.0421725 0.00213 0.0811048 0.1144382 -0.017468 -0.0090647 0.0020903 0.0866149 -0.0339855 0.0145895 0.03096 -0.121466 0.0459603 -0.031753 0.0197713 -0.0600234 0.1328825 -0.0224481 -0.0459119 -0.0288277 -0.1404525 -0.0657627 -0.0941804 -0.0623064 -0.133611 0.1616677 -0.0345868 -0.0675575 -0.0399055 0.0431764 0.0994538 -0.0412565 -0.0327639 -0.028285 0.165638 -0.0343672 0.00368 -0.0199893 -0.1200299 unknown
polarizability: 112.5144012|-8.4769421|72.4077044|-7.9569056|1.4738145|60.4959709 unknown
InChI: InChI=1S/C6H11Br/c1-3-4-5-6(2)7/h3,6H,1,4-5H2,2H3
charge 0 multiplicity 1
18 atoms
Br -2.973805 1.291986 0.012631
C  -0.190196 0.393396 0.228165
C  -1.50719 -0.114898 -0.379485
C  1.025135 -0.505323 -0.157378
C  -1.998352 -1.466894 0.144235
C  2.317569 0.037923 0.416732
C  3.40184 0.409138 -0.308905
H  -0.287478 0.438478 1.330135
H  0.005047 1.422631 -0.122299
H  -1.468929 -0.097919 -1.482347
H  0.857631 -1.531527 0.228056
H  1.105093 -0.578501 -1.259522
H  -2.976174 -1.733612 -0.289272
H  -1.275736 -2.259257 -0.133145
H  -2.095181 -1.452909 1.243769
H  2.348473 0.134272 1.513776
H  4.307542 0.798429 0.169409
H  3.414012 0.334985 -1.403655
