program: Gaussian 09
title: 000138293
version: EM64L-G09RevD.01
frameworkgroup: C1[X(C14H15P)]
method: RPBEPBE
basis: SDD
operation: Freq
keyword: #pfreq=noraman
keyword: PBEPBE/SDD
title: #p freq=noraman PBEPBE/SDD
converged: YES YES NO NO
title: Mulliken charges:
elementType: P C C C C C C C C C C C C C C H H H H H H H H H H H H H H H
charge: 0.867711 -0.089582 -0.090309 -0.884733 -0.944315 -0.259066 -0.267921 -0.268751 -0.259562 -0.237197 -0.229317 -0.229396 -0.237205 -0.226462 -0.226370 0.258838 0.258951 0.218798 0.217742 0.217305 0.220725 0.293823 0.294016 0.221203 0.228970 0.231030 0.230993 0.228985 0.230540 0.230558
chargesum: 0.00000
title: Mulliken charges with hydrogens summed into heavy atoms:
elementType: P C C C C C C C C C C C C C C
charge: 0.867711 -0.089582 -0.090309 -0.148146 -0.509268 -0.038341 0.025902 0.025264 -0.038359 -0.008227 0.001713 0.001597 -0.008220 0.004078 0.004188
polarizability: 2.01617111e+02 -3.03221367e-02 1.39758172e+02 2.68371561e-01 -1.41482018e+01 1.78462300e+02
1716.lowfreq: -0.0013 0.0002 0.0010 4.2007 4.5955 12.1797 29.2499 38.7177 43.6760
frequency: 29.1978 38.7017 43.6651 140.4518 163.3429 168.3158 209.0882 214.9930 234.6583 242.2030 260.8383 344.5309 363.1085 397.0145 403.2147 413.9105 426.0738 475.1737 483.8898 527.9138 596.1927 612.9652 618.1949 673.7460 679.0384 700.3716 702.8097 754.6955 762.0426 849.0187 860.2004 863.5778 881.3586 918.8346 933.7057 938.9632 950.1680 987.1734 988.3389 989.4713 990.4755 1010.6111 1011.6611 1020.9337 1021.0228 1072.5931 1079.0654 1081.4815 1085.6316 1172.6189 1172.8993 1186.6903 1189.0168 1287.9054 1304.9347 1313.6936 1372.2707 1377.9441 1380.0253 1425.3044 1426.8278 1436.7793 1447.3495 1466.0508 1467.3014 1585.4150 1586.7052 1594.3872 1597.0962 2993.9437 3109.1208 3111.5355 3118.9604 3119.8409 3125.6518 3126.7945 3127.2472 3138.2335 3139.0887 3149.8924 3151.0158 3163.7136 3164.3549 3229.2771
redmass: 3.6549 3.9179 5.3613 3.0806 3.8497 2.3985 4.6249 1.5855 2.5531 3.7078 1.8469 5.4396 4.8526 2.3469 2.8578 4.6836 1.4923 3.3532 2.8347 1.3828 6.2551 6.4341 6.1742 6.4599 5.9789 2.1097 2.1453 1.5187 1.5528 1.6538 1.2512 1.2462 1.2186 2.6879 1.3527 1.3738 1.4644 4.1733 6.1380 1.4903 1.3606 1.3198 1.3294 3.0172 2.9908 1.9870 1.9876 1.9572 1.9950 1.0583 1.0572 1.1217 1.1229 1.2286 1.3375 1.2665 1.1253 8.6158 7.6978 2.0797 2.0993 1.0694 1.1351 1.8223 2.0157 6.0548 6.0115 5.9146 5.8888 1.0308 1.0513 1.1007 1.0877 1.0873 1.0998 1.0889 1.0870 1.0910 1.0913 1.0953 1.0951 1.1012 1.1011 1.1150
irintensity: 0.0995 0.0356 0.3264 0.5660 4.8824 0.8479 1.7622 1.0870 5.7552 7.1526 1.9311 5.6449 2.5961 6.7976 0.4121 8.3806 27.7108 34.5857 58.6897 89.2773 56.0614 0.0706 18.5194 14.6813 0.2933 23.8231 53.4251 36.6832 76.4176 2.1403 0.7542 0.1156 7.1301 85.0403 8.2677 4.9038 96.9953 0.1637 0.5992 0.1247 0.3480 0.0427 0.2208 3.5005 1.1014 19.2622 22.9179 5.6490 7.3991 0.3967 0.0973 5.9019 1.7933 5.9536 1.5050 26.7079 8.8940 1.1151 1.1351 0.0041 38.1753 7.5448 25.4752 15.1133 8.7003 0.0003 0.8602 7.2010 0.7168 16.1114 1.0227 15.3173 1.2924 3.2805 12.1538 0.0570 1.1041 3.2027 8.6751 15.5011 56.0691 43.6158 22.9902 9.5178
temp: 298.150 k
press: 1.00000 atm
elementType: 15 6 6 6 6 6 6 6 6 6 6 6 6 6 6 1 1 1 1 1 1 1 1 1 1 1 1 1 1 1
symmnumber: 1
zpe: 633868.4 jmol-1
zpe.correction: 0.241428 hartree
zpe.thermalcorrener: 0.256034 hartree
zpe.thermalcorrenthalpy: 0.256978 hartree
zpe.thermalcorrgfe: 0.199215 hartree
zpe.sumelectzpe: -882.572023 hartree
zpe.sumelectthermal: -882.557417 hartree
zpe.sumelectthermalent: -882.556473 hartree
zpe.sumelectthermalfe: -882.614235 hartree
dipole: 0.0063 -1.8540 2.0907
dipole: 2.7943
quadrupole: -86.6855 -100.9398 -90.3628
quadrupole: -0.0233 0.0622 1.5223
quadrupole: 5.9772 -8.2771 2.2999 -0.0233 0.0622 1.5223
hfenergy: -882.8134503 hartree
pointgroup: C01 [X(C14H15P1)]
dipole: -0.0031328 -0.5932475 -0.9255671 debye
polarizability: 201.6154091|-0.2411679|136.3582966|0.3235894|7.547645|181.8638778 unknown
InChI: InChI=1S/C14H15P/c1-15(2,13-9-5-3-6-10-13)14-11-7-4-8-12-14/h3-12H,1H2,2H3
charge 0 multiplicity 1
30 atoms
P  0.006864 1.412488 0.133847
C  1.556302 0.347908 0.036346
C  -1.549638 0.358897 0.034134
C  0.012187 2.330008 -1.557482
C  0.008377 2.245895 1.662397
C  2.091527 -0.105252 -1.193669
C  -2.158306 -0.028925 1.252176
C  2.170779 -0.03016 1.254437
C  -2.096267 -0.076693 -1.197181
C  3.238779 -0.931312 -1.203391
C  -3.317712 -0.835398 1.237328
C  3.325098 -0.843931 1.240817
C  -3.249016 -0.895062 -1.208292
C  3.858797 -1.300453 0.012702
C  -3.862762 -1.274442 0.00782
H  -0.884545 2.970875 -1.582272
H  0.914075 2.963664 -1.579748
H  0.010923 1.660254 -2.434248
H  -0.927045 2.725153 1.968921
H  0.945058 2.722733 1.968932
H  1.629822 0.17942 -2.145199
H  -1.704647 0.310728 2.191522
H  1.724798 0.321601 2.193026
H  -1.639512 0.216321 -2.148531
H  3.64798 -1.282745 -2.15724
H  -3.789888 -1.126369 2.182365
H  3.802022 -1.127067 2.185854
H  -3.667381 -1.232502 -2.163214
H  4.748647 -1.940103 0.002755
H  -4.756716 -1.90833 -0.003213
