program: Gaussian 09
title: 000138292
version: EM64L-G09RevD.01
frameworkgroup: C1[X(C8H5F3OS2)]
method: RPBEPBE
basis: SDD
operation: Freq
keyword: #p
keyword: freq=noraman
keyword: PBEPBE/SDD
title: #p freq=noraman PBEPBE/SDD
converged: YES YES NO NO
title: Mulliken charges:
elementType: S S F F F O C C C C C C C C H H H H H
charge: 0.282734 0.125179 -0.168630 -0.162268 -0.133600 -0.187154 -0.086164 -0.105685 -0.240934 -0.269399 0.102276 -0.129326 -0.496005 0.304408 0.263955 0.266689 0.257039 0.277803 0.099083
chargesum: 0.00000
title: Mulliken charges with hydrogens summed into heavy atoms:
elementType: S S F F F O C C C C C C C C
charge: 0.282734 0.224262 -0.168630 -0.162268 -0.133600 -0.187154 -0.086164 -0.105685 0.025755 -0.005445 0.102276 0.127712 -0.218202 0.304408
polarizability: 2.14550189e+02 1.44940119e+01 1.39895435e+02 4.81891303e+00 -3.27799723e+00 5.93962667e+01
1716.lowfreq: -7.0935 -2.4280 0.0017 0.0024 0.0025 4.2094 16.4865 40.3203 68.5984
frequency: 16.0866 40.2704 68.5906 79.0255 93.7067 159.4201 189.9899 201.7071 253.8350 257.9160 288.9716 331.1971 383.3878 410.6844 435.9972 465.1233 490.7346 551.5138 552.6842 603.5960 632.5481 660.0529 682.8702 707.2543 716.4029 732.0461 817.8035 839.6514 854.3620 860.3816 919.0813 951.6672 992.8869 1056.0392 1061.2827 1063.9824 1091.2597 1179.5952 1212.2093 1256.1564 1312.1793 1355.5951 1456.9732 1518.6630 1543.5457 1587.0918 2357.7574 3151.9045 3173.5046 3194.0462 3238.0912
redmass: 17.4028 7.7470 9.9193 9.1059 5.9242 9.1951 13.7520 8.3860 5.8486 7.6552 12.5667 12.0969 8.5913 1.4969 9.5091 4.6470 10.7742 3.4971 9.6736 3.9810 12.3093 7.5165 7.3453 4.5939 1.1948 6.9635 5.0633 1.3109 1.5483 3.5810 1.3806 1.3926 12.6424 4.3535 7.3741 1.9725 1.1386 3.4577 2.1813 2.3183 1.7755 2.4737 7.0585 5.0335 10.6419 6.8848 1.0372 1.0908 1.0911 1.0962 1.1006
irintensity: 0.1776 0.8453 0.9380 0.6856 0.5624 1.6003 4.7952 4.0872 2.7041 2.2084 2.6621 3.1520 2.3480 12.4230 9.9386 12.5696 27.1790 3.8762 12.1789 2.2722 13.3018 7.7558 0.9871 3.2818 99.9867 22.6726 26.9331 22.9699 33.2779 49.8433 1.8202 55.1738 238.3359 80.6887 255.4652 67.8300 14.8740 97.3190 17.1651 21.1700 4.0890 1.2555 92.6846 51.1491 517.0642 66.5942 38.2212 2.0514 3.7907 2.3330 0.7669
temp: 298.150 k
press: 1.00000 atm
elementType: 16 16 9 9 9 8 6 6 6 6 6 6 6 6 1 1 1 1 1
symmnumber: 1
zpe: 287410.7 jmol-1
zpe.correction: 0.109469 hartree
zpe.thermalcorrener: 0.123144 hartree
zpe.thermalcorrenthalpy: 0.124088 hartree
zpe.thermalcorrgfe: 0.066387 hartree
zpe.sumelectzpe: -1477.661501 hartree
zpe.sumelectthermal: -1477.647826 hartree
zpe.sumelectthermalent: -1477.646881 hartree
zpe.sumelectthermalfe: -1477.704583 hartree
dipole: -8.0765 -0.4841 -0.2772
dipole: 8.0958
quadrupole: -88.3214 -92.1779 -97.3002
quadrupole: -2.6574 0.9710 -0.4842
quadrupole: 4.2785 0.4219 -4.7004 -2.6574 0.9710 -0.4842
hfenergy: -1477.7709697 hartree
pointgroup: C01 [X(C8H5F3O1S2)]
dipole: -3.1765034 0.2039361 0.1151906 debye
dipolederiv: -0.0433173 -0.1193828 0.1380233 -0.1805345 -0.0044713 0.1274181 0.0346045 0.1284192 0.0675776 0.2972888 0.0677492 0.0948967 -0.1483144 -0.442679 0.0344251 0.0938915 0.0635071 -0.0067693 -0.4947639 -0.0299249 0.0567353 -0.1430073 -0.7365404 -0.2444766 0.0710482 -0.1779483 -0.4074998 -0.5165855 -0.0967076 0.0787116 -0.1900704 -0.3441195 0.1359419 0.1703289 0.0912642 -0.8066731 -0.9697646 0.0970011 -0.159666 0.0077309 -0.3120321 0.0411555 -0.1202111 0.0540492 -0.3252232 -0.9119504 0.0137316 -0.0055595 0.7423745 -0.5386317 0.0399789 -0.0831535 0.0813815 -0.2802823 -0.6837678 0.2430124 -0.0702955 0.1199571 0.0551529 -0.2424258 0.1421199 -0.2150562 -0.002518 1.2230631 -0.1057989 0.0184838 0.2750435 0.8984882 -0.0433647 -0.1515982 -0.0338321 -0.0187978 0.3425705 -0.2913957 0.1081846 -0.0416294 -0.1079049 -0.0358511 0.0057042 -0.0235192 -0.1016695 -1.708399 -0.0733235 0.0104646 -0.2843934 -0.2341499 0.0318366 0.1255773 -0.0057032 -0.1883828 1.5995273 0.0489689 -0.0479756 -0.7346112 0.5175257 -0.0978815 0.020436 -0.1616057 0.0787147 -0.0512546 0.0685965 -0.058092 0.2932898 -0.3099756 0.0749678 -0.2330112 0.1034791 -0.1592933 -0.1382838 0.2302157 -0.2130339 0.0032794 0.0025693 -0.1725202 -0.0130587 -0.2117994 -0.126103 1.9088813 -0.0290074 0.0419661 0.1909189 1.2219921 0.1036958 -0.0822082 0.0922211 1.5343393 0.1184708 0.0198265 -0.0077204 0.0509878 -0.0053967 0.0135697 0.0168142 0.0272772 0.1711865 0.1411558 0.0151011 0.0086965 0.0146593 0.0217055 0.0968408 -0.0207948 0.0846023 0.1219036 -0.0327466 -0.0030885 0.0564373 -0.040298 0.1280247 0.0516823 0.0639315 0.0463317 0.1497492 0.064311 0.0543704 0.003399 0.04245 0.0976374 0.06507 0.0387711 0.050836 0.17653 -0.1444353 -0.109944 -0.053656 0.0221672 0.0928053 0.0199372 -0.0791917 0.0060954 0.1232112 unknown
polarizability: 214.5380891|-15.4338459|133.3460022|-3.6838685|-21.872261|65.9577989 unknown
InChI: InChI=1S/C8H5F3OS2/c9-8(10,11)7(12)4-5(13)6-2-1-3-14-6/h1-4,13H
charge 0 multiplicity 1
19 atoms
S  -2.275072 1.426271 -0.734128
S  -0.464052 -2.510639 0.399748
F  2.691036 1.86889 0.503995
F  3.056438 0.903301 -1.520076
F  4.223253 0.208003 0.297448
O  2.187056 -1.631563 0.361143
C  -1.980167 -0.143194 0.1428
C  -0.637129 -0.706662 0.203252
C  -3.176182 -0.614806 0.69592
C  0.50013 0.090099 0.120134
C  1.850195 -0.426659 0.152039
C  -4.310842 0.228809 0.449838
C  -4.00443 1.356916 -0.299338
C  2.963062 0.625724 -0.130185
H  0.372388 1.174833 0.043423
H  -3.232301 -1.514814 1.313234
H  -5.315082 0.013624 0.820492
H  -4.665507 2.153497 -0.636867
H  -1.810592 -2.769929 0.143828
