program: Gaussian 09
title: 000138290
version: EM64L-G09RevD.01
frameworkgroup: C1[X(C11H16)]
method: RPBEPBE
basis: SDD
operation: Freq
keyword: #p
keyword: freq=noraman
keyword: PBEPBE/SDD
title: #p freq=noraman PBEPBE/SDD
converged: YES YES NO NO
title: Mulliken charges:
elementType: C C C C C C C C C C C H H H H H H H H H H H H H H H H
charge: -0.229868 -0.228500 0.049923 -0.434241 -0.395192 -0.391256 -0.414345 -0.081322 0.216092 -0.770935 -0.770796 0.242956 0.239244 0.206538 0.213618 0.204597 0.194690 0.199474 0.199731 0.209661 0.203043 0.237479 0.216316 0.216262 0.216278 0.234100 0.216453
chargesum: 0.00000
title: Mulliken charges with hydrogens summed into heavy atoms:
elementType: C C C C C C C C C C C
charge: 0.013088 0.010744 0.049923 -0.014085 0.004095 0.007949 -0.001642 -0.081322 0.216092 -0.100878 -0.103965
polarizability: 1.74681047e+02 1.35220003e+01 9.97304965e+01 -1.61225654e+00 -2.10502581e-01 9.65324538e+01
1716.lowfreq: -8.5485 -0.0005 0.0003 0.0004 4.9598 20.1392 48.0455 77.3828 98.4267
frequency: 45.9561 77.3655 98.3442 114.1688 145.8048 175.0813 176.0536 242.2574 299.3051 311.1780 388.5329 412.2042 426.1629 504.8442 547.0100 556.1068 577.0171 641.2737 744.6815 785.9029 815.3437 830.1261 866.6758 929.1534 932.3155 948.9794 951.5279 974.9448 991.9797 1025.8445 1034.6847 1067.4037 1086.5937 1089.3748 1117.9926 1145.3663 1168.7454 1175.6112 1200.9657 1249.2429 1260.3273 1292.9273 1303.5105 1327.7473 1340.3303 1341.2221 1349.9885 1375.9369 1389.7071 1452.8442 1456.7054 1461.3216 1461.7969 1462.9894 1468.5196 1469.5654 1475.8178 1533.9224 2062.3285 2955.7756 2959.1228 2966.0279 2969.5990 2977.1507 2981.5881 3021.4432 3028.3007 3028.8122 3030.3846 3037.8959 3046.3390 3073.0361 3089.8323 3092.7006 3096.7933
redmass: 3.3289 2.9595 2.7146 2.8028 1.0234 1.2528 2.0029 2.5649 2.5791 1.8245 3.1255 3.1781 2.4792 3.2539 4.0017 3.9439 3.6853 2.5677 3.1482 2.0355 2.2412 2.7267 2.3939 1.6283 2.6255 1.4176 1.5832 1.6568 1.3850 1.2825 1.6858 1.5706 1.8963 1.7365 1.6927 1.2053 1.5922 1.5261 4.6331 1.2777 1.3093 1.3591 1.7671 1.4301 1.4309 1.4484 1.4456 1.2106 1.2089 1.2757 1.0499 1.0499 1.1167 1.0959 1.0785 1.0475 1.0845 3.1000 11.3946 1.0374 1.0374 1.0598 1.0613 1.0633 1.0624 1.0997 1.0969 1.0980 1.0974 1.1015 1.1038 1.0869 1.0908 1.0978 1.0977
irintensity: 0.4415 1.1336 0.2655 0.8664 0.0157 0.5322 0.3934 2.4940 0.6793 1.6665 2.0440 2.7845 1.2145 2.7104 0.6381 2.2178 0.7874 5.2878 9.7000 4.9225 7.5023 4.5413 3.5843 6.9127 0.2557 1.0707 4.2840 2.6834 4.1810 1.7206 4.0297 2.1233 2.5143 16.8500 0.9466 0.6824 0.5585 35.1443 7.1908 1.9087 0.2735 0.6286 4.0277 3.5484 1.0155 0.5788 4.9821 17.4013 0.0758 9.4061 0.0284 9.2154 11.9453 9.2100 16.8016 18.1619 4.6930 14.0427 43.2400 25.6217 118.8568 52.3657 33.2401 22.3766 45.7128 47.5620 34.8723 1.1779 57.5894 45.1873 83.2751 17.3681 48.4673 28.1099 29.7109
temp: 298.150 k
press: 1.00000 atm
elementType: 6 6 6 6 6 6 6 6 6 6 6 1 1 1 1 1 1 1 1 1 1 1 1 1 1 1 1
symmnumber: 1
zpe: 619153.8 jmol-1
zpe.correction: 0.235823 hartree
zpe.thermalcorrener: 0.247758 hartree
zpe.thermalcorrenthalpy: 0.248702 hartree
zpe.thermalcorrgfe: 0.197729 hartree
zpe.sumelectzpe: -427.831430 hartree
zpe.sumelectthermal: -427.819495 hartree
zpe.sumelectthermalent: -427.818550 hartree
zpe.sumelectthermalfe: -427.869524 hartree
dipole: -0.3460 0.1683 -0.0428
dipole: 0.3871
quadrupole: -62.7832 -65.8963 -67.5641
quadrupole: 1.3649 -0.2511 -0.1870
quadrupole: 2.6314 -0.4818 -2.1496 1.3649 -0.2511 -0.1870
hfenergy: -428.0672529 hartree
pointgroup: C01 [X(C11H16)]
dipole: -0.1363539 -0.0287793 0.0614625 debye
polarizability: 174.5927866|-7.4287415|97.6322411|11.6990052|-1.5643902|98.7189695 unknown
InChI: InChI=1S/C11H16/c1-8(2)7-11-9-5-3-4-6-10(9)11/h9-10H,3-6H2,1-2H3
charge 0 multiplicity 1
27 atoms
C  -1.068524 1.348314 -0.63496
C  -1.068611 0.052386 -1.516689
C  0.153955 0.462459 -0.736585
C  -1.878738 1.395523 0.676445
C  -1.909249 -1.153892 -1.086469
C  -2.893247 0.230232 0.808023
C  -2.264077 -1.128255 0.420283
C  1.388407 0.229432 -0.366021
C  2.645201 -0.008491 0.025649
C  3.847032 0.520463 -0.748363
C  2.960594 -0.823389 1.27505
H  -1.010328 2.298089 -1.183703
H  -1.01577 0.210281 -2.603449
H  -2.417817 2.360382 0.73429
H  -1.180561 1.372031 1.535844
H  -1.375033 -2.090004 -1.342669
H  -2.851499 -1.148029 -1.672601
H  -3.762368 0.418732 0.1451
H  -3.279986 0.196783 1.844961
H  -1.352496 -1.302446 1.026667
H  -2.965206 -1.954676 0.644793
H  3.542041 1.094723 -1.638436
H  4.466066 1.17781 -0.105265
H  4.49711 -0.314678 -1.078177
H  3.578645 -1.707245 1.019157
H  2.044957 -1.17499 1.77864
H  3.544902 -0.219145 1.997786
